1,3,4,6,8-Pentaazacycl[3.3.3]azine

Gas phase ion energetics data

Data compiled by: Sharon G. Lias, John E. Bartmess, Joel F. Liebman, John L. Holmes, Rhoda D. Levin, and W. Gary Mallard

Ionization energy determinations

IE (eV) Method Reference Comment
8.38PERossman, Leonard, et al., 1985Vertical value

References

Rossman, Leonard, et al., 1985
Rossman, M.A.; Leonard, N.J.; Urano, S.; LeBreton, P.R., Synthesis and valence orbital structures of azacycl[3.3.3]azines in a systematic series, J. Am. Chem. Soc., 1985, 107, 3884. [all data]