Morpholine, 4-cyclohexyl-
- Formula: C10H19NO
- Molecular weight: 169.2640
- IUPAC Standard InChIKey: BRKHZWFIIVVNTA-UHFFFAOYSA-N
- CAS Registry Number: 6425-41-8
- Chemical structure:
View 3d structure (requires JavaScript / HTML 5) - Other names: Cyclohexylmorpholine; N-Cyclohexylmorpholine; 4-Cyclohexylmorpholine; Morpholine, 4-cyclohexyl-, (aerosol); N-(1-Cyclohexenyl)morpholine; N-Cyclohexylmorpholine aerosol

Gas phase ion energetics data

Data compiled by: Sharon G. Lias, Rhoda D. Levin, and Sherif A. Kafafi
Ionization energy determinations
IE (eV) | Method | Reference | Comment |
---|---|---|---|
8.18 ± 0.03 | PE | Colonna, Distefano, et al., 1975 | Vertical value |

References

Colonna, Distefano, et al., 1975
Colonna, F.P.; Distefano, G.; Pignataro, S.; Pitacco, G.; Valentin, E.,
Ionization energies of some amines and enamines and an estimation of their relative basicity in gaseous phase,
J. Chem. Soc. Faraday Trans. 2, 1975, 71, 1572. [all data]