1,1':2',1'':2'',1'''-Quaterphenyl
- Formula: C24H18
- Molecular weight: 306.3997
- IUPAC Standard InChIKey: YAVCXSHORWKJQQ-UHFFFAOYSA-N
- CAS Registry Number: 641-96-3
- Chemical structure:
View 3d structure (requires JavaScript / HTML 5) - Other names: O,O'-Quaterphenyl; o-Quaterphenyl; O,O-Quaterphenyl; 1,1'-Biphenyl, 2,2'-diphenyl-; ortho-Quaterphenyl

Phase change data

Data compiled by: Robert L. Brown and Stephen E. Stein
Quantity | Value | Units | Method | Reference | Comment |
---|---|---|---|---|---|
Tboil | 693.2 | K | N/A | Weast and Grasselli, 1989 |

Gas phase ion energetics data

Data compiled by: Henry M. Rosenstock, Keith Draxl, Bruce W. Steiner, and John T. Herron
Ionization energy determinations
IE (eV) | Method | Reference |
---|---|---|
8.52 ± 0.05 | EI | Gallegos, 1967 |
Appearance energy determinations
Ion | AE (eV) | Other Products | Method | Reference | Comment |
---|---|---|---|---|---|
C17H11+ | 13.0 ± 0.2 | ? | EI | Gallegos, 1967 | |
C18H10+ | 19.0 ± 0.4 | ? | EI | Gallegos, 1967 | |
C18H12+ | 13.0 ± 0.1 | ? | EI | Gallegos, 1967 | |
C18H13+ | 12.8 ± 0.1 | ? | EI | Gallegos, 1967 | |
C23H13+ | 15.5 ± 0.2 | ? | EI | Gallegos, 1967 | |
C23H15+ | 12.7 ± 0.1 | ? | EI | Gallegos, 1967 | |
C24H17+ | 11.7 ± 0.1 | H | EI | Gallegos, 1967 |

Van Den Dool and Kratz RI, non-polar column, temperature ramp

Column type | Active phase | I | Reference | Comment |
---|---|---|---|---|
Capillary | SE-52 | 2365. | Beernaert, 1979 | He, 50. C @ 5. min, 6. K/min; Column length: 33.3 m; Column diameter: 0.50 mm; Tend: 320. C |

Lee's RI, non-polar column, temperature ramp

Column type | Active phase | I | Reference | Comment |
---|---|---|---|---|
Capillary | SE-52 | 423.63 | Lee, Vassilaros, et al., 1979 | 12. m/0.3 mm/0.34 μm, He, 2. K/min; Tstart: 50. C; Tend: 250. C |

Lee's RI, non-polar column, custom temperature program

Column type | Active phase | I | Reference | Comment |
---|---|---|---|---|
Capillary | Polydimethyl siloxanes | 423.63 | Eckel and Kind, 2003 | Program: not specified |
Capillary | SE-52 | 394.68 | Shlyakhov, 1984 | Program: not specified |
Capillary | SE-52 | 423.63 | Shlyakhov, 1984 | Program: not specified |

References

Weast and Grasselli, 1989
CRC Handbook of Data on Organic Compounds, 2nd Editon, Weast,R.C and Grasselli, J.G., ed(s)., CRC Press, Inc., Boca Raton, FL, 1989, 1. [all data]
Gallegos, 1967
Gallegos, E.J.,
Mass spectrometry of some polyphenyls,
J. Phys. Chem., 1967, 71, 1647. [all data]
Beernaert, 1979
Beernaert, H.,
Gas Chromatographic Analysis of Polyclylic Aromatic Hydrocarbons,
J. Chromatogr., 1979, 173, 1, 109-118, https://doi.org/10.1016/S0021-9673(01)80450-7
. [all data]
Lee, Vassilaros, et al., 1979
Lee, M.L.; Vassilaros, D.L.; White, C.M.; Novotny, M.,
Retention Indices for Programmed-Temperature Capillary-Column Gas Chromatography of Polycyclic Aromatic Hydrocarbons,
Anal. Chem., 1979, 51, 6, 768-773, https://doi.org/10.1021/ac50042a043
. [all data]
Eckel and Kind, 2003
Eckel, W.P.; Kind, T.,
Use of boiling point-Lee retention index correlation for rapid review of gas chromatography-mass spectrometry data,
Anal. Chim. Acta., 2003, 494, 1-2, 235-243, https://doi.org/10.1016/j.aca.2003.08.003
. [all data]
Shlyakhov, 1984
Shlyakhov, A.F.,
Gas chromatography in organic geochemistry, Nedra, Moscow, 1984, 221. [all data]