Formic acid
- Formula: CH2O2
- Molecular weight: 46.0254
- IUPAC Standard InChIKey: BDAGIHXWWSANSR-UHFFFAOYSA-N
- CAS Registry Number: 64-18-6
- Chemical structure:
View 3d structure (requires JavaScript / HTML 5) - Other names: Methanoic acid; Aminic acid; Bilorin; Collo-Bueglatt; Collo-Didax; Formisoton; Formylic acid; Hydrogen carboxylic acid; Myrmicyl; HCOOH; Acide formique; Acido formico; Ameisensaeure; Kwas metaniowy; Kyselina mravenci; Mierenzuur; Rcra waste number U123; UN 1779; Formira; Add-F; Amasil
- Gas phase thermochemistry data
- Condensed phase thermochemistry data
- Phase change data
- Reaction thermochemistry data
- Henry's Law data
- Gas phase ion energetics data
- Ion clustering data
- IR Spectrum
- Mass spectrum (electron ionization)
- Vibrational and/or electronic energy levels
- Gas Chromatography
- References
- Notes

Gas phase thermochemistry data

Data compiled as indicated in comments:
ALS - Hussein Y. Afeefy, Joel F. Liebman, and Stephen E. Stein
DRB - Donald R. Burgess, Jr.
GT - Glushko Thermocenter, Russian Academy of Sciences, Moscow
Quantity | Value | Units | Method | Reference | Comment |
---|---|---|---|---|---|
ΔfH°gas | -378.6 | kJ/mol | Cm | Guthrie, 1974 | Heat of hydrolysis; ALS |
ΔfH°gas | -379.0 | kJ/mol | N/A | Lebedeva, 1964 | Value computed using ΔfHliquid° value of -425.5±0.3 kj/mol from Lebedeva, 1964 and ΔvapH° value of 46.5 kj/mol from Guthrie, 1974.; DRB |
ΔfH°gas | -379.2 ± 0.6 | kJ/mol | Ccb | Lebedeva, 1964 | Value computed using ΔfHliquid° from Lebedeva, 1964 and ΔvapH° value of 46.3 kJ/mol from Konicek and Wadso, 1970.; DRB |
ΔfH°gas | -378.3 | kJ/mol | N/A | Sinke, 1959 | Value computed using ΔfHliquid° value of -424.8±0.3 kj/mol from Sinke, 1959 and ΔvapH° value of 46.5 kj/mol from Guthrie, 1974.; DRB |
ΔfH°gas | -378.5 ± 0.6 | kJ/mol | Ccb | Sinke, 1959 | Value computed using ΔfHliquid° from Sinke, 1959 and ΔvapH° value of 46.3 kJ/mol from Konicek and Wadso, 1970.; DRB |
Quantity | Value | Units | Method | Reference | Comment |
S°gas | 248.70 ± 0.42 | J/mol*K | N/A | Millikan R.C., 1957 | Other third-law S(298.15 K) value is 248.11(1.26) J/mol*K [ Halford J.O., 1942, Millikan R.C., 1957]. Please also see Waring W., 1952.; GT |
Constant pressure heat capacity of gas
Cp,gas (J/mol*K) | Temperature (K) | Reference | Comment |
---|---|---|---|
33.26 | 50. | Chao J., 1986 | p=1 bar. Selected entropies and heat capacities are in close agreement with statistically calculated values [ Fukushima K., 1971] and value of S(298.15 K) calculated by ab initio method [ East A.L.L., 1997]. Maximum discrepancies with other statistical calculations [ Waring W., 1952, Green J.H.S., 1961, Gurvich, Veyts, et al., 1989] amount to 1.1-3.9 J/mol*K for S(T) and 3.0-5.9 J/mol*K for Cp(T). Please also see Chao J., 1978.; GT |
33.44 | 100. | ||
34.91 | 150. | ||
37.83 | 200. | ||
43.54 | 273.15 | ||
45.68 ± 0.07 | 298.15 | ||
45.84 | 300. | ||
54.52 | 400. | ||
62.63 | 500. | ||
69.81 | 600. | ||
76.04 | 700. | ||
81.34 | 800. | ||
85.77 | 900. | ||
89.40 | 1000. | ||
92.33 | 1100. | ||
94.65 | 1200. | ||
96.48 | 1300. | ||
97.91 | 1400. | ||
99.02 | 1500. |

Condensed phase thermochemistry data

Data compiled as indicated in comments:
ALS - Hussein Y. Afeefy, Joel F. Liebman, and Stephen E. Stein
DH - Eugene S. Domalski and Elizabeth D. Hearing
Quantity | Value | Units | Method | Reference | Comment |
---|---|---|---|---|---|
ΔfH°liquid | -425.09 | kJ/mol | Cm | Guthrie, 1974 | Heat of hydrolysis; ALS |
ΔfH°liquid | -425.5 ± 0.3 | kJ/mol | Ccb | Lebedeva, 1964 | ALS |
ΔfH°liquid | -424.8 ± 0.3 | kJ/mol | Ccb | Sinke, 1959 | ALS |
Quantity | Value | Units | Method | Reference | Comment |
ΔcH°liquid | -253.8 ± 0.3 | kJ/mol | Ccb | Lebedeva, 1964 | Corresponding ΔfHºliquid = -425.51 kJ/mol (simple calculation by NIST; no Washburn corrections); ALS |
ΔcH°liquid | -254.6 ± 0.3 | kJ/mol | Ccb | Sinke, 1959 | Corresponding ΔfHºliquid = -424.72 kJ/mol (simple calculation by NIST; no Washburn corrections); ALS |
Quantity | Value | Units | Method | Reference | Comment |
S°liquid | 131.84 | J/mol*K | N/A | Stout and Fisher, 1941 | Includes 2.89 J/mol*K for zero-point entropy.; DH |
S°liquid | 128.4 | J/mol*K | N/A | Parks, Kelley, et al., 1929 | Extrapolation below 90 K, 29.7 J/mol*K. Revision of previous data.; DH |
S°liquid | 143.1 | J/mol*K | N/A | Gibson, Latimer, et al., 1920 | Used Berthelot's value, 10125 J/mol for H fusion. Extrapolation below 70 K, no details.; DH |
Constant pressure heat capacity of liquid
Cp,liquid (J/mol*K) | Temperature (K) | Reference | Comment |
---|---|---|---|
99.04 | 298.15 | Stout and Fisher, 1941 | T = 15 to 300 K.; DH |
98.10 | 298.15 | Glagoleva and Chervov, 1936 | Temperature range: 298.15, 333.15, 353.15 K.; DH |
100.0 | 290. | Radulescu and Jula, 1934 | DH |
98.3 | 291.5 | Gibson, Latimer, et al., 1920 | T = 71 to 292 K. Value is unsmoothed experimental datum.; DH |
95.4 | 298. | von Reis, 1881 | T = 291 to 385 K.; DH |

Phase change data

Data compiled as indicated in comments:
TRC - Thermodynamics Research Center, NIST Boulder Laboratories, Chris Muzny director
AC - William E. Acree, Jr., James S. Chickos
ALS - Hussein Y. Afeefy, Joel F. Liebman, and Stephen E. Stein
DH - Eugene S. Domalski and Elizabeth D. Hearing
Quantity | Value | Units | Method | Reference | Comment |
---|---|---|---|---|---|
Tboil | 373.9 ± 0.5 | K | AVG | N/A | Average of 25 out of 30 values; Individual data points |
Quantity | Value | Units | Method | Reference | Comment |
Tfus | 281.5 ± 0.6 | K | AVG | N/A | Average of 9 values; Individual data points |
Quantity | Value | Units | Method | Reference | Comment |
Ttriple | 281.45 | K | N/A | Wilhoit, Chao, et al., 1985 | Uncertainty assigned by TRC = 0.1 K; TRC |
Ttriple | 281.40 | K | N/A | Stout and Fisher, 1941, 2 | Uncertainty assigned by TRC = 0.06 K; TRC |
Quantity | Value | Units | Method | Reference | Comment |
Ptriple | 0.0236 | bar | N/A | Taylor and Bruton, 1952 | Uncertainty assigned by TRC = 0.000067 bar; TRC |
Quantity | Value | Units | Method | Reference | Comment |
Tc | 577. | K | N/A | Anselme and Teja, 1990 | Uncertainty assigned by TRC = 30. K; Tc > 577 K, which was observed with decomposition; TRC |
Tc | 588. | K | N/A | Ambrose and Ghiassee, 1987 | Uncertainty assigned by TRC = 10. K; TRC |
Tc | 580. | K | N/A | Majer and Svoboda, 1985 | |
Quantity | Value | Units | Method | Reference | Comment |
ΔvapH° | 46.3 | kJ/mol | N/A | Majer and Svoboda, 1985 | |
ΔvapH° | 36.0 | kJ/mol | A | Stephenson and Malanowski, 1987 | Based on data from 283. to 384. K.; AC |
ΔvapH° | 46.3 ± 0.5 | kJ/mol | C | Konicek and Wadso, 1970 | ALS |
ΔvapH° | 46.3 ± 0.5 | kJ/mol | C | Konicek, Wadsö, et al., 1970 | AC |
ΔvapH° | 19.9 | kJ/mol | N/A | Stout and Fisher, 1941, 3 | AC |
Enthalpy of vaporization
ΔvapH (kJ/mol) | Temperature (K) | Method | Reference | Comment |
---|---|---|---|---|
22.69 | 373.8 | N/A | Majer and Svoboda, 1985 | |
35.2 | 315. | EB | Ambrose and Ghiassee, 1987, 2 | Based on data from 300. to 392. K.; AC |
35.2 | 325. | N/A | Dreisbach and Shrader, 1949 | Based on data from 310. to 374. K. See also Dreisbach and Martin, 1949.; AC |
29.6 | 303. | N/A | Campbell and Campbell, 1934 | AC |
20.3 | 315. | N/A | Coolidge, 1930 | Based on data from 273. to 373. K.; AC |
20.9 | 338. | N/A | Coolidge, 1930 | Based on data from 273. to 373. K.; AC |
20.4 | 315. | C | Coolidge, 1930 | AC |
21.1 | 338. | C | Coolidge, 1930 | AC |
36.8 | 288. | N/A | Kahlbaum, 1894 | Based on data from 273. to 307. K.; AC |
47.7 | 374. | N/A | Kahlbaum, 1883 | Based on data from 295. to 374. K.; AC |
Enthalpy of vaporization
ΔvapH = A exp(-αTr)
(1 − Tr)β
ΔvapH =
Enthalpy of vaporization (at saturation pressure)
(kJ/mol)
Tr = reduced temperature (T / Tc)
View plot Requires a JavaScript / HTML 5 canvas capable browser.
Temperature (K) | 298. to 374. |
---|---|
A (kJ/mol) | 23.8 |
α | 2.1043 |
β | -1.2652 |
Tc (K) | 580. |
Reference | Majer and Svoboda, 1985 |
Antoine Equation Parameters
log10(P) = A − (B / (T + C))
P = vapor pressure (bar)
T = temperature (K)
View plot Requires a JavaScript / HTML 5 canvas capable browser.
Temperature (K) | A | B | C | Reference | Comment |
---|---|---|---|---|---|
273.7 to 307.4 | 2.00121 | 515. | -139.408 | Kahlbaum, 1894, 2 | Coefficents calculated by NIST from author's data. |
Enthalpy of sublimation
ΔsubH (kJ/mol) | Temperature (K) | Method | Reference | Comment |
---|---|---|---|---|
60.5 | 275. | N/A | Stephenson and Malanowski, 1987 | Based on data from 268. to 281. K.; AC |
62. ± 1. | 213. | TE,ME | Calis-Van Ginkel, Calis, et al., 1978 | Based on data from 203. to 218. K.; AC |
60.1 | 264. | A | Stull, 1947 | Based on data from 253. to 275. K.; AC |
60.7 | 266. | N/A | Coolidge, 1930 | Based on data from 265. to 268. K. See also Jones, 1960.; AC |
Enthalpy of fusion
ΔfusH (kJ/mol) | Temperature (K) | Reference | Comment |
---|---|---|---|
12.678 | 281.40 | Stout and Fisher, 1941 | DH |
Entropy of fusion
ΔfusS (J/mol*K) | Temperature (K) | Reference | Comment |
---|---|---|---|
45.05 | 281.40 | Stout and Fisher, 1941 | DH |

Reaction thermochemistry data

Data compiled as indicated in comments:
B - John E. Bartmess
M - Michael M. Meot-Ner (Mautner) and Sharon G. Lias
Individual Reactions
By formula: Cl- + CH2O2 = (Cl- • CH2O2)
Quantity | Value | Units | Method | Reference | Comment |
---|---|---|---|---|---|
ΔrH° | 115. ± 8.4 | kJ/mol | TDAs | French, Ikuta, et al., 1982 | gas phase; B,M |
ΔrH° | 116. ± 8.8 | kJ/mol | CIDT | Walker and Sunderlin, 1999 | gas phase; B |
ΔrH° | 107. ± 8.4 | kJ/mol | IMRE | Larson and McMahon, 1984 | gas phase; B,M |
ΔrH° | 156. ± 8.4 | kJ/mol | TDAs | Yamdagni and Kebarle, 1971 | gas phase; In serious disagreement with other's values. Source of error not obvious.; B,M |
Quantity | Value | Units | Method | Reference | Comment |
ΔrS° | 103. | J/mol*K | PHPMS | French, Ikuta, et al., 1982 | gas phase; M |
ΔrS° | 101. | J/mol*K | N/A | Larson and McMahon, 1984, 2 | gas phase; switching reaction(Cl-)t-C4H9OH, Entropy change calculated or estimated; French, Ikuta, et al., 1982; M |
ΔrS° | 166. | J/mol*K | PHPMS | Yamdagni and Kebarle, 1971 | gas phase; M |
Quantity | Value | Units | Method | Reference | Comment |
ΔrG° | 84.1 ± 8.4 | kJ/mol | TDAs | French, Ikuta, et al., 1982 | gas phase; B |
ΔrG° | 77.0 ± 8.4 | kJ/mol | IMRE | Larson and McMahon, 1984 | gas phase; B,M |
ΔrG° | 106. ± 8.4 | kJ/mol | TDAs | Yamdagni and Kebarle, 1971 | gas phase; In serious disagreement with other's values. Source of error not obvious.; B |
By formula: CHO2- + H+ = CH2O2
Quantity | Value | Units | Method | Reference | Comment |
---|---|---|---|---|---|
ΔrH° | 1449. ± 5.0 | kJ/mol | D-EA | Kim, Bradforth, et al., 1995 | gas phase; dHacid(0K) = 344.67±0.62 kcal/mol; B |
ΔrH° | 1445. ± 9.2 | kJ/mol | G+TS | Caldwell, Renneboog, et al., 1989 | gas phase; B |
ΔrH° | 1445. ± 9.2 | kJ/mol | G+TS | Fujio, McIver, et al., 1981 | gas phase; value altered from reference due to change in acidity scale; B |
ΔrH° | 1444. ± 12. | kJ/mol | G+TS | Cumming and Kebarle, 1978 | gas phase; B |
ΔrH° | 1423. ± 19. | kJ/mol | EIAE | Muftakhov, Vasil'ev, et al., 1999 | gas phase; B |
Quantity | Value | Units | Method | Reference | Comment |
ΔrG° | 1419. ± 6.3 | kJ/mol | H-TS | Kim, Bradforth, et al., 1995 | gas phase; dHacid(0K) = 344.67±0.62 kcal/mol; B |
ΔrG° | 1415. ± 8.4 | kJ/mol | IMRE | Caldwell, Renneboog, et al., 1989 | gas phase; B |
ΔrG° | 1416. ± 8.4 | kJ/mol | IMRE | Fujio, McIver, et al., 1981 | gas phase; value altered from reference due to change in acidity scale; B |
ΔrG° | 1415. ± 8.4 | kJ/mol | IMRE | Cumming and Kebarle, 1978 | gas phase; B |
By formula: F- + CH2O2 = (F- • CH2O2)
Quantity | Value | Units | Method | Reference | Comment |
---|---|---|---|---|---|
ΔrH° | 190. ± 8.4 | kJ/mol | IMRE | Larson and McMahon, 1983 | gas phase; These relative affinities are ca. 10 kcal/mol weaker than threshold values (see Wenthold and Squires, 1995) for donors greater than ca. 27 kcal/mol in free energy. This discrepancy has not yet been resolved, though the stronger value appears preferable.; B,M |
Quantity | Value | Units | Method | Reference | Comment |
ΔrS° | 101. | J/mol*K | N/A | Larson and McMahon, 1983 | gas phase; switching reaction(F-)H2O, Entropy change calculated or estimated; Arshadi, Yamdagni, et al., 1970; M |
Quantity | Value | Units | Method | Reference | Comment |
ΔrG° | 159. ± 8.4 | kJ/mol | IMRE | Larson and McMahon, 1983 | gas phase; These relative affinities are ca. 10 kcal/mol weaker than threshold values (see Wenthold and Squires, 1995) for donors greater than ca. 27 kcal/mol in free energy. This discrepancy has not yet been resolved, though the stronger value appears preferable.; B,M |
By formula: CH5O+ + CH2O2 = (CH5O+ • CH2O2)
Bond type: Hydrogen bonds of the type OH-O between organics
Quantity | Value | Units | Method | Reference | Comment |
---|---|---|---|---|---|
ΔrH° | 134. | kJ/mol | ICR | Larson and McMahon, 1982 | gas phase; switching reaction((CH3)2OH+)(CH3)2O, Entropy change calculated or estimated; Grimsrud and Kebarle, 1973, Lias, Liebman, et al., 1984, Keesee and Castleman, 1986; M |
Quantity | Value | Units | Method | Reference | Comment |
ΔrS° | 116. | J/mol*K | N/A | Larson and McMahon, 1982 | gas phase; switching reaction((CH3)2OH+)(CH3)2O, Entropy change calculated or estimated; Grimsrud and Kebarle, 1973, Lias, Liebman, et al., 1984, Keesee and Castleman, 1986; M |
Quantity | Value | Units | Method | Reference | Comment |
ΔrG° | 99.6 | kJ/mol | ICR | Larson and McMahon, 1982 | gas phase; switching reaction((CH3)2OH+)(CH3)2O, Entropy change calculated or estimated; Grimsrud and Kebarle, 1973, Lias, Liebman, et al., 1984, Keesee and Castleman, 1986; M |
By formula: I- + CH2O2 = (I- • CH2O2)
Quantity | Value | Units | Method | Reference | Comment |
---|---|---|---|---|---|
ΔrH° | 79.1 ± 4.2 | kJ/mol | TDAs | Caldwell and Kebarle, 1984 | gas phase; B,M |
ΔrH° | 54.0 ± 8.8 | kJ/mol | CIDT | Walker and Sunderlin, 1999 | gas phase; Authors suggest real value somewhere between this and Caldwell and Kebarle, 1984; B |
Quantity | Value | Units | Method | Reference | Comment |
ΔrS° | 86.6 | J/mol*K | PHPMS | Caldwell and Kebarle, 1984 | gas phase; M |
Quantity | Value | Units | Method | Reference | Comment |
ΔrG° | 53.1 ± 4.2 | kJ/mol | TDAs | Caldwell and Kebarle, 1984 | gas phase; B |
By formula: (Cl- • CH2O2) + CH2O2 = (Cl- • 2CH2O2)
Quantity | Value | Units | Method | Reference | Comment |
---|---|---|---|---|---|
ΔrH° | 46.9 ± 8.8 | kJ/mol | CIDT | Walker and Sunderlin, 1999 | gas phase; B |
ΔrH° | 143. ± 13. | kJ/mol | N/A | Luczynski, Wlodek, et al., 1978 | gas phase; Buffer gas: H2. Value too bound based on French, Ikuta, et al., 1982, by Grimsrud fractionation factor ( Williamson, Knighton, et al., 1996).; B,M |
Quantity | Value | Units | Method | Reference | Comment |
ΔrS° | 230. | J/mol*K | HPMS | Luczynski, Wlodek, et al., 1978 | gas phase; Entropy change is questionable; M |
By formula: (Cl- • 4CH2O2) + CH2O2 = (Cl- • 5CH2O2)
Quantity | Value | Units | Method | Reference | Comment |
---|---|---|---|---|---|
ΔrH° | 42.3 ± 8.4 | kJ/mol | N/A | Luczynski, Wlodek, et al., 1978 | gas phase; Buffer gas: H2. Value too bound based on French, Ikuta, et al., 1982, by Grimsrud fractionation factor ( Williamson, Knighton, et al., 1996).; B,M |
Quantity | Value | Units | Method | Reference | Comment |
ΔrS° | 48.1 | J/mol*K | HPMS | Luczynski, Wlodek, et al., 1978 | gas phase; Entropy change is questionable; M |
By formula: (Cl- • 2CH2O2) + CH2O2 = (Cl- • 3CH2O2)
Quantity | Value | Units | Method | Reference | Comment |
---|---|---|---|---|---|
ΔrH° | 93. ± 11. | kJ/mol | N/A | Luczynski, Wlodek, et al., 1978 | gas phase; Buffer gas: H2. Value too bound based on French, Ikuta, et al., 1982, by Grimsrud fractionation factor ( Williamson, Knighton, et al., 1996).; B,M |
Quantity | Value | Units | Method | Reference | Comment |
ΔrS° | 150. | J/mol*K | HPMS | Luczynski, Wlodek, et al., 1978 | gas phase; Entropy change is questionable; M |
By formula: CHO2- + CH2O2 = (CHO2- • CH2O2)
Quantity | Value | Units | Method | Reference | Comment |
---|---|---|---|---|---|
ΔrH° | 154. ± 4.2 | kJ/mol | N/A | Meot-Ner and Sieck, 1986 | gas phase; B,M |
Quantity | Value | Units | Method | Reference | Comment |
ΔrS° | 164. | J/mol*K | PHPMS | Meot-Ner and Sieck, 1986 | gas phase; large ΔrH, ΔrS,; cyclic structure? pyrolysis?; M |
Quantity | Value | Units | Method | Reference | Comment |
ΔrG° | 105. ± 6.7 | kJ/mol | TDAs | Meot-Ner and Sieck, 1986 | gas phase; B |
By formula: (CHO2- • 4CH2O2) + CH2O2 = (CHO2- • 5CH2O2)
Quantity | Value | Units | Method | Reference | Comment |
---|---|---|---|---|---|
ΔrH° | 42.3 ± 8.4 | kJ/mol | N/A | Luczynski, Wlodek, et al., 1978 | gas phase; Buffer gas H2. There may be appreciable fractionation of neutral gases: Williamson, Knighton, et al., 1996; B,M |
Quantity | Value | Units | Method | Reference | Comment |
ΔrS° | 50. | J/mol*K | HPMS | Luczynski, Wlodek, et al., 1978 | gas phase; Entropy change is questionable; M |
By formula: (Cl- • 3CH2O2) + CH2O2 = (Cl- • 4CH2O2)
Quantity | Value | Units | Method | Reference | Comment |
---|---|---|---|---|---|
ΔrH° | 59.0 ± 9.2 | kJ/mol | N/A | Luczynski, Wlodek, et al., 1978 | gas phase; Buffer gas: H2. Value too bound based on French, Ikuta, et al., 1982, by Grimsrud fractionation factor ( Williamson, Knighton, et al., 1996).; B,M |
Quantity | Value | Units | Method | Reference | Comment |
ΔrS° | 84. | J/mol*K | HPMS | Luczynski, Wlodek, et al., 1978 | gas phase; M |
By formula: (CHO2- • 3CH2O2) + CH2O2 = (CHO2- • 4CH2O2)
Quantity | Value | Units | Method | Reference | Comment |
---|---|---|---|---|---|
ΔrH° | 59.4 ± 8.8 | kJ/mol | N/A | Luczynski, Wlodek, et al., 1978 | gas phase; Buffer gas H2. There may be appreciable fractionation of neutral gases: Williamson, Knighton, et al., 1996; B,M |
Quantity | Value | Units | Method | Reference | Comment |
ΔrS° | 90.0 | J/mol*K | HPMS | Luczynski, Wlodek, et al., 1978 | gas phase; M |
By formula: (CHO2- • 2CH2O2) + CH2O2 = (CHO2- • 3CH2O2)
Quantity | Value | Units | Method | Reference | Comment |
---|---|---|---|---|---|
ΔrH° | 84. ± 11. | kJ/mol | N/A | Luczynski, Wlodek, et al., 1978 | gas phase; Buffer gas H2. There may be appreciable fractionation of neutral gases: Williamson, Knighton, et al., 1996; B,M |
Quantity | Value | Units | Method | Reference | Comment |
ΔrS° | 130. | J/mol*K | HPMS | Luczynski, Wlodek, et al., 1978 | gas phase; M |
By formula: (CHO2- • CH2O2) + CH2O2 = (CHO2- • 2CH2O2)
Quantity | Value | Units | Method | Reference | Comment |
---|---|---|---|---|---|
ΔrH° | 109. ± 13. | kJ/mol | N/A | Luczynski, Wlodek, et al., 1978 | gas phase; Buffer gas H2. There may be appreciable fractionation of neutral gases: Williamson, Knighton, et al., 1996; B,M |
Quantity | Value | Units | Method | Reference | Comment |
ΔrS° | 140. | J/mol*K | HPMS | Luczynski, Wlodek, et al., 1978 | gas phase; M |
By formula: CH6N+ + CH2O2 = (CH6N+ • CH2O2)
Bond type: Hydrogen bonds of the type NH+-O between organics
Quantity | Value | Units | Method | Reference | Comment |
---|---|---|---|---|---|
ΔrH° | 79.5 | kJ/mol | PHPMS | Meot-Ner, 1984 | gas phase; M |
Quantity | Value | Units | Method | Reference | Comment |
ΔrS° | 101. | J/mol*K | PHPMS | Meot-Ner, 1984 | gas phase; M |
By formula: CH2NO5- + H2O + CH2O2 = CH4NO6-
Quantity | Value | Units | Method | Reference | Comment |
---|---|---|---|---|---|
ΔrG° | 18.4 ± 0.84 | kJ/mol | IMRE | Viidanoja, Reiner, et al., 2000 | gas phase; B |
+
= CH2BrO2-
By formula: Br- + CH2O2 = CH2BrO2-
Quantity | Value | Units | Method | Reference | Comment |
---|---|---|---|---|---|
ΔrH° | 72.0 ± 7.1 | kJ/mol | CIDT | Walker and Sunderlin, 1999 | gas phase; B |
By formula: CH2IO2- + 2CH2O2 = C2H4IO4-
Quantity | Value | Units | Method | Reference | Comment |
---|---|---|---|---|---|
ΔrH° | 41.8 ± 8.8 | kJ/mol | CIDT | Walker and Sunderlin, 1999 | gas phase; B |
+
= CH2NO5-
By formula: NO3- + CH2O2 = CH2NO5-
Quantity | Value | Units | Method | Reference | Comment |
---|---|---|---|---|---|
ΔrG° | 47.70 ± 0.84 | kJ/mol | IMRE | Viidanoja, Reiner, et al., 1998 | gas phase; B |
By formula: CH2BrO2- + 2CH2O2 = C2H4BrO4-
Quantity | Value | Units | Method | Reference | Comment |
---|---|---|---|---|---|
ΔrH° | 40. ± 7.1 | kJ/mol | CIDT | Walker and Sunderlin, 1999 | gas phase; B |

Henry's Law data

Data compiled by: Rolf Sander
Henry's Law constant (water solution)
kH(T) = k°H exp(d(ln(kH))/d(1/T) ((1/T) - 1/(298.15 K)))
k°H = Henry's law constant for solubility in water at 298.15 K (mol/(kg*bar))
d(ln(kH))/d(1/T) = Temperature dependence constant (K)
k°H (mol/(kg*bar)) | d(ln(kH))/d(1/T) (K) | Method | Reference | Comment |
---|---|---|---|---|
8900. | 6100. | M | N/A | |
5200. | C | N/A | ||
5300. | 5700. | Q | N/A | |
5200. | C | N/A | ||
5400. | C | N/A | ||
5500. | M | N/A | ||
890. | Q | N/A | missing citation give several references for the Henry's law constants but don't assign them to specific species. | |
3700. | 5700. | C | N/A | |
13000. | M | N/A | The value given here was measured at a liquid phase volume mixing ratio of 1 ppmv. missing citation found that the Henry's law constant changes at higher concentrations. | |
7600. | X | N/A | Value given here as quoted by missing citation. | |
3500. | 5700. | C | N/A | |
5700. | T | N/A | ||
3700. | 5700. | C | N/A | |
5600. | T | N/A | ||
3700. | 5700. | T | N/A | |
6000. | X | N/A | Value given here as quoted by missing citation. |

Gas phase ion energetics data

Data evaluated as indicated in comments:
HL - Edward P. Hunter and Sharon G. Lias
L - Sharon G. Lias
Data compiled as indicated in comments:
B - John E. Bartmess
LBLHLM - Sharon G. Lias, John E. Bartmess, Joel F. Liebman, John L. Holmes, Rhoda D. Levin, and W. Gary Mallard
LLK - Sharon G. Lias, Rhoda D. Levin, and Sherif A. Kafafi
RDSH - Henry M. Rosenstock, Keith Draxl, Bruce W. Steiner, and John T. Herron
LL - Sharon G. Lias and Joel F. Liebman
Quantity | Value | Units | Method | Reference | Comment |
---|---|---|---|---|---|
IE (evaluated) | 11.33 ± 0.01 | eV | N/A | N/A | L |
Quantity | Value | Units | Method | Reference | Comment |
Proton affinity (review) | 742.0 | kJ/mol | N/A | Hunter and Lias, 1998 | HL |
Quantity | Value | Units | Method | Reference | Comment |
Gas basicity | 710.3 | kJ/mol | N/A | Hunter and Lias, 1998 | HL |
Ionization energy determinations
IE (eV) | Method | Reference | Comment |
---|---|---|---|
11.31 | PI | Traeger, 1985 | LBLHLM |
11.329 ± 0.002 | S | Bell, Ng, et al., 1975 | LLK |
11.16 ± 0.03 | PI | Warneck, 1974 | LLK |
11.314 ± 0.002 | PI | Knowles and Nicholson, 1974 | LLK |
11.3 | PE | Watanabe, Yokoyama, et al., 1973 | LLK |
11.33 | PE | Watanabe, Yokoyama, et al., 1973, 2 | LLK |
11.35 ± 0.03 | PE | Thomas, 1972 | LLK |
11.16 ± 0.03 | PI | Matthews and Warneck, 1969 | RDSH |
11.33 | PE | Brundle, Turner, et al., 1969 | RDSH |
11.05 ± 0.03 | PI | Vilesov, 1960 | RDSH |
11.05 ± 0.01 | PI | Watanabe, 1957 | RDSH |
11.33 | S | Price and Evans, 1937 | RDSH |
11.5 | PE | Von Niessen, Bieri, et al., 1980 | Vertical value; LLK |
11.34 | PE | Benoit and Harrison, 1977 | Vertical value; LLK |
10.7 | PE | Rao, 1975 | Vertical value; LLK |
11.51 | PE | Kimura, Katsumata, et al., 1975 | Vertical value; LLK |
Appearance energy determinations
Ion | AE (eV) | Other Products | Method | Reference | Comment |
---|---|---|---|---|---|
C+ | 22.7 ± 0.5 | O+H2O | EI | Stepanov, Perov, et al., 1988 | LL |
CHO+ | 12.76 | OH | PI | Traeger, 1985 | LBLHLM |
CHO+ | 13.0 ± 0.1 | OH | PI | Golovin, Akopyan, et al., 1979 | LLK |
CHO+ | 12.79 ± 0.03 | OH | PI | Warneck, 1974 | LLK |
CHO+ | 12.79 ± 0.03 | OH | PI | Matthews and Warneck, 1969 | RDSH |
CHO2+ | 12.4 ± 0.1 | H | PI | Golovin, Akopyan, et al., 1979 | LLK |
CHO2+ | 12.26 | H | PI | Akopyan and Villem, 1976 | LLK |
CHO2+ | 12.29 ± 0.03 | H | PI | Warneck, 1974 | LLK |
HO+ | 17.97 ± 0.06 | HCO | PI | Warneck, 1974 | LLK |
O+ | 20.0 ± 0.5 | CO+H2 | EI | Stepanov, Perov, et al., 1988 | LL |
De-protonation reactions
By formula: CHO2- + H+ = CH2O2
Quantity | Value | Units | Method | Reference | Comment |
---|---|---|---|---|---|
ΔrH° | 1449. ± 5.0 | kJ/mol | D-EA | Kim, Bradforth, et al., 1995 | gas phase; dHacid(0K) = 344.67±0.62 kcal/mol; B |
ΔrH° | 1445. ± 9.2 | kJ/mol | G+TS | Caldwell, Renneboog, et al., 1989 | gas phase; B |
ΔrH° | 1445. ± 9.2 | kJ/mol | G+TS | Fujio, McIver, et al., 1981 | gas phase; value altered from reference due to change in acidity scale; B |
ΔrH° | 1444. ± 12. | kJ/mol | G+TS | Cumming and Kebarle, 1978 | gas phase; B |
ΔrH° | 1423. ± 19. | kJ/mol | EIAE | Muftakhov, Vasil'ev, et al., 1999 | gas phase; B |
Quantity | Value | Units | Method | Reference | Comment |
ΔrG° | 1419. ± 6.3 | kJ/mol | H-TS | Kim, Bradforth, et al., 1995 | gas phase; dHacid(0K) = 344.67±0.62 kcal/mol; B |
ΔrG° | 1415. ± 8.4 | kJ/mol | IMRE | Caldwell, Renneboog, et al., 1989 | gas phase; B |
ΔrG° | 1416. ± 8.4 | kJ/mol | IMRE | Fujio, McIver, et al., 1981 | gas phase; value altered from reference due to change in acidity scale; B |
ΔrG° | 1415. ± 8.4 | kJ/mol | IMRE | Cumming and Kebarle, 1978 | gas phase; B |

Ion clustering data

Data compiled as indicated in comments:
B - John E. Bartmess
M - Michael M. Meot-Ner (Mautner) and Sharon G. Lias
Clustering reactions
+
= CH2BrO2-
By formula: Br- + CH2O2 = CH2BrO2-
Quantity | Value | Units | Method | Reference | Comment |
---|---|---|---|---|---|
ΔrH° | 72.0 ± 7.1 | kJ/mol | CIDT | Walker and Sunderlin, 1999 | gas phase; B |
By formula: CHO2- + CH2O2 = (CHO2- • CH2O2)
Quantity | Value | Units | Method | Reference | Comment |
---|---|---|---|---|---|
ΔrH° | 154. ± 4.2 | kJ/mol | N/A | Meot-Ner and Sieck, 1986 | gas phase; B,M |
Quantity | Value | Units | Method | Reference | Comment |
ΔrS° | 164. | J/mol*K | PHPMS | Meot-Ner and Sieck, 1986 | gas phase; large ΔrH, ΔrS,; cyclic structure? pyrolysis?; M |
Quantity | Value | Units | Method | Reference | Comment |
ΔrG° | 105. ± 6.7 | kJ/mol | TDAs | Meot-Ner and Sieck, 1986 | gas phase; B |
By formula: (CHO2- • CH2O2) + CH2O2 = (CHO2- • 2CH2O2)
Quantity | Value | Units | Method | Reference | Comment |
---|---|---|---|---|---|
ΔrH° | 109. ± 13. | kJ/mol | N/A | Luczynski, Wlodek, et al., 1978 | gas phase; Buffer gas H2. There may be appreciable fractionation of neutral gases: Williamson, Knighton, et al., 1996; B,M |
Quantity | Value | Units | Method | Reference | Comment |
ΔrS° | 140. | J/mol*K | HPMS | Luczynski, Wlodek, et al., 1978 | gas phase; M |
By formula: (CHO2- • 2CH2O2) + CH2O2 = (CHO2- • 3CH2O2)
Quantity | Value | Units | Method | Reference | Comment |
---|---|---|---|---|---|
ΔrH° | 84. ± 11. | kJ/mol | N/A | Luczynski, Wlodek, et al., 1978 | gas phase; Buffer gas H2. There may be appreciable fractionation of neutral gases: Williamson, Knighton, et al., 1996; B,M |
Quantity | Value | Units | Method | Reference | Comment |
ΔrS° | 130. | J/mol*K | HPMS | Luczynski, Wlodek, et al., 1978 | gas phase; M |
By formula: (CHO2- • 3CH2O2) + CH2O2 = (CHO2- • 4CH2O2)
Quantity | Value | Units | Method | Reference | Comment |
---|---|---|---|---|---|
ΔrH° | 59.4 ± 8.8 | kJ/mol | N/A | Luczynski, Wlodek, et al., 1978 | gas phase; Buffer gas H2. There may be appreciable fractionation of neutral gases: Williamson, Knighton, et al., 1996; B,M |
Quantity | Value | Units | Method | Reference | Comment |
ΔrS° | 90.0 | J/mol*K | HPMS | Luczynski, Wlodek, et al., 1978 | gas phase; M |
By formula: (CHO2- • 4CH2O2) + CH2O2 = (CHO2- • 5CH2O2)
Quantity | Value | Units | Method | Reference | Comment |
---|---|---|---|---|---|
ΔrH° | 42.3 ± 8.4 | kJ/mol | N/A | Luczynski, Wlodek, et al., 1978 | gas phase; Buffer gas H2. There may be appreciable fractionation of neutral gases: Williamson, Knighton, et al., 1996; B,M |
Quantity | Value | Units | Method | Reference | Comment |
ΔrS° | 50. | J/mol*K | HPMS | Luczynski, Wlodek, et al., 1978 | gas phase; Entropy change is questionable; M |
By formula: CH2BrO2- + 2CH2O2 = C2H4BrO4-
Quantity | Value | Units | Method | Reference | Comment |
---|---|---|---|---|---|
ΔrH° | 40. ± 7.1 | kJ/mol | CIDT | Walker and Sunderlin, 1999 | gas phase; B |
By formula: CH2IO2- + 2CH2O2 = C2H4IO4-
Quantity | Value | Units | Method | Reference | Comment |
---|---|---|---|---|---|
ΔrH° | 41.8 ± 8.8 | kJ/mol | CIDT | Walker and Sunderlin, 1999 | gas phase; B |
By formula: CH2NO5- + H2O + CH2O2 = CH4NO6-
Quantity | Value | Units | Method | Reference | Comment |
---|---|---|---|---|---|
ΔrG° | 18.4 ± 0.84 | kJ/mol | IMRE | Viidanoja, Reiner, et al., 2000 | gas phase; B |
By formula: CH5O+ + CH2O2 = (CH5O+ • CH2O2)
Bond type: Hydrogen bonds of the type OH-O between organics
Quantity | Value | Units | Method | Reference | Comment |
---|---|---|---|---|---|
ΔrH° | 134. | kJ/mol | ICR | Larson and McMahon, 1982 | gas phase; switching reaction((CH3)2OH+)(CH3)2O, Entropy change calculated or estimated; Grimsrud and Kebarle, 1973, Lias, Liebman, et al., 1984, Keesee and Castleman, 1986; M |
Quantity | Value | Units | Method | Reference | Comment |
ΔrS° | 116. | J/mol*K | N/A | Larson and McMahon, 1982 | gas phase; switching reaction((CH3)2OH+)(CH3)2O, Entropy change calculated or estimated; Grimsrud and Kebarle, 1973, Lias, Liebman, et al., 1984, Keesee and Castleman, 1986; M |
Quantity | Value | Units | Method | Reference | Comment |
ΔrG° | 99.6 | kJ/mol | ICR | Larson and McMahon, 1982 | gas phase; switching reaction((CH3)2OH+)(CH3)2O, Entropy change calculated or estimated; Grimsrud and Kebarle, 1973, Lias, Liebman, et al., 1984, Keesee and Castleman, 1986; M |
By formula: CH6N+ + CH2O2 = (CH6N+ • CH2O2)
Bond type: Hydrogen bonds of the type NH+-O between organics
Quantity | Value | Units | Method | Reference | Comment |
---|---|---|---|---|---|
ΔrH° | 79.5 | kJ/mol | PHPMS | Meot-Ner, 1984 | gas phase; M |
Quantity | Value | Units | Method | Reference | Comment |
ΔrS° | 101. | J/mol*K | PHPMS | Meot-Ner, 1984 | gas phase; M |
By formula: Cl- + CH2O2 = (Cl- • CH2O2)
Quantity | Value | Units | Method | Reference | Comment |
---|---|---|---|---|---|
ΔrH° | 115. ± 8.4 | kJ/mol | TDAs | French, Ikuta, et al., 1982 | gas phase; B,M |
ΔrH° | 116. ± 8.8 | kJ/mol | CIDT | Walker and Sunderlin, 1999 | gas phase; B |
ΔrH° | 107. ± 8.4 | kJ/mol | IMRE | Larson and McMahon, 1984 | gas phase; B,M |
ΔrH° | 156. ± 8.4 | kJ/mol | TDAs | Yamdagni and Kebarle, 1971 | gas phase; In serious disagreement with other's values. Source of error not obvious.; B,M |
Quantity | Value | Units | Method | Reference | Comment |
ΔrS° | 103. | J/mol*K | PHPMS | French, Ikuta, et al., 1982 | gas phase; M |
ΔrS° | 101. | J/mol*K | N/A | Larson and McMahon, 1984, 2 | gas phase; switching reaction(Cl-)t-C4H9OH, Entropy change calculated or estimated; French, Ikuta, et al., 1982; M |
ΔrS° | 166. | J/mol*K | PHPMS | Yamdagni and Kebarle, 1971 | gas phase; M |
Quantity | Value | Units | Method | Reference | Comment |
ΔrG° | 84.1 ± 8.4 | kJ/mol | TDAs | French, Ikuta, et al., 1982 | gas phase; B |
ΔrG° | 77.0 ± 8.4 | kJ/mol | IMRE | Larson and McMahon, 1984 | gas phase; B,M |
ΔrG° | 106. ± 8.4 | kJ/mol | TDAs | Yamdagni and Kebarle, 1971 | gas phase; In serious disagreement with other's values. Source of error not obvious.; B |
By formula: (Cl- • CH2O2) + CH2O2 = (Cl- • 2CH2O2)
Quantity | Value | Units | Method | Reference | Comment |
---|---|---|---|---|---|
ΔrH° | 46.9 ± 8.8 | kJ/mol | CIDT | Walker and Sunderlin, 1999 | gas phase; B |
ΔrH° | 143. ± 13. | kJ/mol | N/A | Luczynski, Wlodek, et al., 1978 | gas phase; Buffer gas: H2. Value too bound based on French, Ikuta, et al., 1982, by Grimsrud fractionation factor ( Williamson, Knighton, et al., 1996).; B,M |
Quantity | Value | Units | Method | Reference | Comment |
ΔrS° | 230. | J/mol*K | HPMS | Luczynski, Wlodek, et al., 1978 | gas phase; Entropy change is questionable; M |
By formula: (Cl- • 2CH2O2) + CH2O2 = (Cl- • 3CH2O2)
Quantity | Value | Units | Method | Reference | Comment |
---|---|---|---|---|---|
ΔrH° | 93. ± 11. | kJ/mol | N/A | Luczynski, Wlodek, et al., 1978 | gas phase; Buffer gas: H2. Value too bound based on French, Ikuta, et al., 1982, by Grimsrud fractionation factor ( Williamson, Knighton, et al., 1996).; B,M |
Quantity | Value | Units | Method | Reference | Comment |
ΔrS° | 150. | J/mol*K | HPMS | Luczynski, Wlodek, et al., 1978 | gas phase; Entropy change is questionable; M |
By formula: (Cl- • 3CH2O2) + CH2O2 = (Cl- • 4CH2O2)
Quantity | Value | Units | Method | Reference | Comment |
---|---|---|---|---|---|
ΔrH° | 59.0 ± 9.2 | kJ/mol | N/A | Luczynski, Wlodek, et al., 1978 | gas phase; Buffer gas: H2. Value too bound based on French, Ikuta, et al., 1982, by Grimsrud fractionation factor ( Williamson, Knighton, et al., 1996).; B,M |
Quantity | Value | Units | Method | Reference | Comment |
ΔrS° | 84. | J/mol*K | HPMS | Luczynski, Wlodek, et al., 1978 | gas phase; M |
By formula: (Cl- • 4CH2O2) + CH2O2 = (Cl- • 5CH2O2)
Quantity | Value | Units | Method | Reference | Comment |
---|---|---|---|---|---|
ΔrH° | 42.3 ± 8.4 | kJ/mol | N/A | Luczynski, Wlodek, et al., 1978 | gas phase; Buffer gas: H2. Value too bound based on French, Ikuta, et al., 1982, by Grimsrud fractionation factor ( Williamson, Knighton, et al., 1996).; B,M |
Quantity | Value | Units | Method | Reference | Comment |
ΔrS° | 48.1 | J/mol*K | HPMS | Luczynski, Wlodek, et al., 1978 | gas phase; Entropy change is questionable; M |
By formula: F- + CH2O2 = (F- • CH2O2)
Quantity | Value | Units | Method | Reference | Comment |
---|---|---|---|---|---|
ΔrH° | 190. ± 8.4 | kJ/mol | IMRE | Larson and McMahon, 1983 | gas phase; These relative affinities are ca. 10 kcal/mol weaker than threshold values (see Wenthold and Squires, 1995) for donors greater than ca. 27 kcal/mol in free energy. This discrepancy has not yet been resolved, though the stronger value appears preferable.; B,M |
Quantity | Value | Units | Method | Reference | Comment |
ΔrS° | 101. | J/mol*K | N/A | Larson and McMahon, 1983 | gas phase; switching reaction(F-)H2O, Entropy change calculated or estimated; Arshadi, Yamdagni, et al., 1970; M |
Quantity | Value | Units | Method | Reference | Comment |
ΔrG° | 159. ± 8.4 | kJ/mol | IMRE | Larson and McMahon, 1983 | gas phase; These relative affinities are ca. 10 kcal/mol weaker than threshold values (see Wenthold and Squires, 1995) for donors greater than ca. 27 kcal/mol in free energy. This discrepancy has not yet been resolved, though the stronger value appears preferable.; B,M |
By formula: I- + CH2O2 = (I- • CH2O2)
Quantity | Value | Units | Method | Reference | Comment |
---|---|---|---|---|---|
ΔrH° | 79.1 ± 4.2 | kJ/mol | TDAs | Caldwell and Kebarle, 1984 | gas phase; B,M |
ΔrH° | 54.0 ± 8.8 | kJ/mol | CIDT | Walker and Sunderlin, 1999 | gas phase; Authors suggest real value somewhere between this and Caldwell and Kebarle, 1984; B |
Quantity | Value | Units | Method | Reference | Comment |
ΔrS° | 86.6 | J/mol*K | PHPMS | Caldwell and Kebarle, 1984 | gas phase; M |
Quantity | Value | Units | Method | Reference | Comment |
ΔrG° | 53.1 ± 4.2 | kJ/mol | TDAs | Caldwell and Kebarle, 1984 | gas phase; B |
+
= CH2NO5-
By formula: NO3- + CH2O2 = CH2NO5-
Quantity | Value | Units | Method | Reference | Comment |
---|---|---|---|---|---|
ΔrG° | 47.70 ± 0.84 | kJ/mol | IMRE | Viidanoja, Reiner, et al., 1998 | gas phase; B |

Vibrational and/or electronic energy levels

Data compiled by: Takehiko Shimanouchi
Symmetry: Cs Symmetry Number σ = 1
Sym. | No | Approximate | Selected Freq. | Infrared | Raman | Comments | ||||
---|---|---|---|---|---|---|---|---|---|---|
Species | type of mode | Value | Rating | Value | Phase | Value | Phase | |||
a' | 1 | OH str | 3570 | D | 3570 M | gas | ||||
a' | 2 | CH str | 2943 | C | 2942.8 M | gas | ||||
a' | 3 | C=O str | 1770 | C | 1770 VS | gas | ||||
a' | 4 | CH bend | 1387 | C | 1387 VW | gas | ||||
a' | 5 | OH bend | 1229 | C | 1229 W | gas | ||||
a' | 6 | C-O str | 1105 | C | 1105.3 S | gas | ||||
a' | 7 | OCO deform | 625 | C | 625 M | gas | ||||
a | 8 | CH bend | 1033 | C | 1033 W | gas | ||||
a | 9 | Torsion | 638 | C | 638 S | gas | ||||
Source: Shimanouchi, 1972

Van Den Dool and Kratz RI, non-polar column, temperature ramp

Column type | Active phase | I | Reference | Comment |
---|---|---|---|---|
Capillary | DB-1 | 543. | Helmig, Pollock, et al., 1996 | 30. m/0.25 mm/1. μm, 6. K/min; Tstart: -50. C; Tend: 180. C |

Van Den Dool and Kratz RI, non-polar column, custom temperature program

Column type | Active phase | I | Reference | Comment |
---|---|---|---|---|
Capillary | Methyl Silicone | 512. | Peng, Yang, et al., 1991 | Program: not specified |
Packed | SE-30 | 512. | Peng, Ding, et al., 1988 | Supelcoport; Chromosorb; Column length: 3.05 m; Program: 40C(5min) => 10C/min => 200C or 250C (60min) |

Van Den Dool and Kratz RI, polar column, temperature ramp

Column type | Active phase | I | Reference | Comment |
---|---|---|---|---|
Capillary | DB-Wax | 1510. | Mahajan, Goddik, et al., 2004 | 30. m/0.25 mm/0.5 μm, He, 40. C @ 2. min, 5. K/min, 230. C @ 10. min |

Van Den Dool and Kratz RI, polar column, custom temperature program

Column type | Active phase | I | Reference | Comment |
---|---|---|---|---|
Capillary | Stabilwax | 1528. | Natali N., Chinnici F., et al., 2006 | 30. m/0.25 mm/0.25 μm, He; Program: 40C => 3C/min => 100C => 5C/min => 240C(10min) |
Capillary | DB-Wax | 1543.6 | Yang, Chyau, et al., 1998 | He; Column length: 50. m; Column diameter: 0.32 mm; Program: 50C => 2.5C/min => 150C => 1.5C/min => 210C |

Normal alkane RI, non-polar column, temperature ramp

Column type | Active phase | I | Reference | Comment |
---|---|---|---|---|
Capillary | HP-1 | 495. | Castel, Fernandez, et al., 2006 | 50. m/0.2 mm/0.33 μm, He, 60. C @ 4. min, 2. K/min, 250. C @ 30. min |

Normal alkane RI, non-polar column, custom temperature program

Column type | Active phase | I | Reference | Comment |
---|---|---|---|---|
Capillary | Methyl Silicone | 490. | Zenkevich, Korolenko, et al., 1995 | Program: not specified |

Normal alkane RI, polar column, temperature ramp

Column type | Active phase | I | Reference | Comment |
---|---|---|---|---|
Capillary | DB-Wax | 1470. | Guo, Wu, et al., 2008 | 30. m/0.25 mm/0.25 μm, Helium, 60. C @ 2. min, 10. K/min, 250. C @ 10. min |
Capillary | DB-Wax | 1470. | Guo, Wu, et al., 2008 | 30. m/0.25 mm/0.25 μm, Helium, 60. C @ 2. min, 10. K/min, 250. C @ 10. min |
Capillary | DB-Wax | 1470. | Guo, Wu, et al., 2008 | 30. m/0.25 mm/0.25 μm, Helium, 60. C @ 2. min, 10. K/min, 250. C @ 10. min |
Capillary | RTX-Wax | 1485. | Prososki, Etzel, et al., 2007 | 30. m/0.25 mm/0.5 μm, He, 40. C @ 5. min, 10. K/min, 220. C @ 10. min |
Capillary | Supelcowax-10 | 1521. | Vichi, Castellote, et al., 2003 | 30. m/0.25 mm/0.25 μm, He, 40. C @ 10. min, 3. K/min; Tend: 200. C |
Capillary | DB-Wax | 1492. | Sekiwa, Kubota, et al., 1997 | He, 2. K/min; Column length: 60. m; Column diameter: 0.25 mm; Tstart: 60. C; Tend: 180. C |
Capillary | DB-Wax | 1499. | Umano, Hagi, et al., 1995 | He, 40. C @ 2. min, 2. K/min; Column length: 60. m; Column diameter: 0.25 mm; Tend: 200. C |
Capillary | FFAP | 1505. | Vernin, Metzger, et al., 1988 | He, 60. C @ 5. min, 2. K/min; Column length: 50. m; Column diameter: 0.28 mm; Tend: 240. C |

Normal alkane RI, polar column, custom temperature program

Column type | Active phase | I | Reference | Comment |
---|---|---|---|---|
Capillary | DB-Wax | 1501. | Gonzalez-Rios, Suarez-Quiroz, et al., 2007 | 30. m/0.25 mm/0.25 μm, Hydrogen; Program: 44 0C 3 0C/min -> 170 0C 8 0C/min -> 250 0C |
Capillary | CP-Wax 52CB | 1532. | Muresan, Eillebrecht, et al., 2000 | 50. m/0.32 mm/1.2 μm; Program: 40C(10min) => 3C/min => 190C => 10C/min => 250C(5min) |
Capillary | Polyethylene Glycol | 1533. | Zenkevich, Korolenko, et al., 1995 | Program: not specified |

References

Guthrie, 1974
Guthrie, J.P.,
Hydration of carboxamides. Evaluation of the free energy change for addition of water to acetamide and formamide derivatives,
J. Am. Chem. Soc., 1974, 96, 3608-3615. [all data]
Lebedeva, 1964
Lebedeva, N.D.,
Heats of combustion of monocarboxylic acids,
Russ. J. Phys. Chem. (Engl. Transl.), 1964, 38, 1435-1437. [all data]
Konicek and Wadso, 1970
Konicek, J.; Wadso, I.,
Enthalpies of vaporization of organic compounds. VII. Some carboxylic acids,
Acta Chem. Scand., 1970, 24, 2612-26. [all data]
Sinke, 1959
Sinke, G.C.,
The heat of formation of formic acid,
J. Phys. Chem., 1959, 63, 2063. [all data]
Millikan R.C., 1957
Millikan R.C.,
Infrared spectra and vibrational assignment of monomeric formic acid,
J. Chem. Phys., 1957, 27, 1305-1308. [all data]
Halford J.O., 1942
Halford J.O.,
Entropy of the monomeric forms of formic acid and acetic acid,
J. Chem. Phys., 1942, 10, 582-584. [all data]
Waring W., 1952
Waring W.,
Some thermodynamic properties of formic acid,
Chem. Rev., 1952, 51, 171-183. [all data]
Chao J., 1986
Chao J.,
Thermodynamic properties of key organic oxygen compounds in the carbon range C1 to C4. Part 2. Ideal gas properties,
J. Phys. Chem. Ref. Data, 1986, 15, 1369-1436. [all data]
Fukushima K., 1971
Fukushima K.,
Normal coordinate treatment and thermodynamic properties of the cis-trans isomers of formic acid and its deutero-analog,
J. Chem. Thermodyn., 1971, 3, 553-562. [all data]
East A.L.L., 1997
East A.L.L.,
Ab initio statistical thermodynamical models for the computation of third-law entropies,
J. Chem. Phys., 1997, 106, 6655-6674. [all data]
Green J.H.S., 1961
Green J.H.S.,
Thermodynamic properties of organic oxygen compounds. Part III. Formic acid,
J. Chem. Soc., 1961, 2241-2242. [all data]
Gurvich, Veyts, et al., 1989
Gurvich, L.V.; Veyts, I.V.; Alcock, C.B.,
Thermodynamic Properties of Individual Substances, 4th ed.; Vols. 1 and 2, Hemisphere, New York, 1989. [all data]
Chao J., 1978
Chao J.,
Ideal gas thermodynamic properties of methanoic and ethanoic acids,
J. Phys. Chem. Ref. Data, 1978, 7, 363-377. [all data]
Stout and Fisher, 1941
Stout, J.W.; Fisher, L.H.,
The entropy of formic acid. The heat capacity from 15 to 300K. Heats of fusion and vaporization,
J. Chem. Phys., 1941, 9, 163-168. [all data]
Parks, Kelley, et al., 1929
Parks, G.S.; Kelley, K.K.; Huffman, H.M.,
Thermal data on organic compounds. V. A revision of the entropies and free energies of nineteen organic compounds,
J. Am. Chem. Soc., 1929, 51, 1969-1973. [all data]
Gibson, Latimer, et al., 1920
Gibson, G.E.; Latimer, W.M.; Parks, G.S.,
Entropy changes at low temperatures. I. Formic acid and urea. A test of the third law of thermodynamics,
J. Am. Chem. Soc., 1920, 42, 1533-1542. [all data]
Glagoleva and Chervov, 1936
Glagoleva, A.A.; Chervov, S.I.,
Investigation of the heat capacity of formic acid and its aqueous solutions,
Zhur. Obshch. Khim., 1936, 6, 685-690. [all data]
Radulescu and Jula, 1934
Radulescu, D.; Jula, O.,
Beiträge zur Bestimmung der Abstufung der Polarität des Aminstickstoffes in den organischen Verbindungen,
Z. Phys. Chem., 1934, B26, 390-393. [all data]
von Reis, 1881
von Reis, M.A.,
Die specifische Wärme flüssiger organischer Verbindungen und ihre Beziehung zu deren Moleculargewicht,
Ann. Physik [3], 1881, 13, 447-464. [all data]
Wilhoit, Chao, et al., 1985
Wilhoit, R.C.; Chao, J.; Hall, K.R.,
Thermodynamic Properties of Key Organic Compounds in the Carbon Range C1 to C4. Part 1. Properties of Condensed Phases,
J. Phys. Chem. Ref. Data, 1985, 14, 1. [all data]
Stout and Fisher, 1941, 2
Stout, J.W.; Fisher, L.H.,
The entropy of formic acid. The heat capacity from 15 to 300 K. Heats of fusion and vaporization,
J. Chem. Phys., 1941, 9, 163-8. [all data]
Taylor and Bruton, 1952
Taylor, M.D.; Bruton, J.,
The vapour phase dissociation of some carboxylic acids. II. Formic and propionic acids.,
J. Am. Chem. Soc., 1952, 74, 4151. [all data]
Anselme and Teja, 1990
Anselme, M.J.; Teja, A.S.,
The critical properties of rapidly reacting substances,
AIChE Symp. Ser., 1990, 86, 279, 128-32. [all data]
Ambrose and Ghiassee, 1987
Ambrose, D.; Ghiassee, N.B.,
Vapor Pressures and Critical Temperatures and Critical Pressures of Some Alkanoic Acids: C1 to C10,
J. Chem. Thermodyn., 1987, 19, 505. [all data]
Majer and Svoboda, 1985
Majer, V.; Svoboda, V.,
Enthalpies of Vaporization of Organic Compounds: A Critical Review and Data Compilation, Blackwell Scientific Publications, Oxford, 1985, 300. [all data]
Stephenson and Malanowski, 1987
Stephenson, Richard M.; Malanowski, Stanislaw,
Handbook of the Thermodynamics of Organic Compounds, 1987, https://doi.org/10.1007/978-94-009-3173-2
. [all data]
Konicek, Wadsö, et al., 1970
Konicek, Jiri; Wadsö, Ingemar; Munch-Petersen, J.; Ohlson, Ragnar; Shimizu, Akira,
Enthalpies of Vaporization of Organic Compounds. VII. Some Carboxylic Acids.,
Acta Chem. Scand., 1970, 24, 2612-2616, https://doi.org/10.3891/acta.chem.scand.24-2612
. [all data]
Stout and Fisher, 1941, 3
Stout, J.W.; Fisher, Leon H.,
The Entropy of Formic Acid. The Heat Capacity from 15 to 300°K. Heats of Fusion and Vaporization,
J. Chem. Phys., 1941, 9, 2, 163, https://doi.org/10.1063/1.1750869
. [all data]
Ambrose and Ghiassee, 1987, 2
Ambrose, D.; Ghiassee, N.B.,
Vapour pressures and critical temperatures and critical pressures of some alkanoic acids: C1 to C10,
The Journal of Chemical Thermodynamics, 1987, 19, 5, 505-519, https://doi.org/10.1016/0021-9614(87)90147-9
. [all data]
Dreisbach and Shrader, 1949
Dreisbach, R.R.; Shrader, S.A.,
Vapor Pressure--Temperature Data on Some Organic Compounds,
Ind. Eng. Chem., 1949, 41, 12, 2879-2880, https://doi.org/10.1021/ie50480a054
. [all data]
Dreisbach and Martin, 1949
Dreisbach, R.R.; Martin, R.A.,
Physical Data on Some Organic Compounds,
Ind. Eng. Chem., 1949, 41, 12, 2875-2878, https://doi.org/10.1021/ie50480a053
. [all data]
Campbell and Campbell, 1934
Campbell, Alan Newton; Campbell, Alexandra Jean Robson,
The thermodynamics of binary liquid mixtures : formic acid and water,
Trans. Faraday Soc., 1934, 30, 1109, https://doi.org/10.1039/tf9343001109
. [all data]
Coolidge, 1930
Coolidge, Albert Sprague,
THE VAPOR PRESSURE AND HEATS OF FUSION AND VAPORIZATION OF FORMIC ACID,
J. Am. Chem. Soc., 1930, 52, 5, 1874-1887, https://doi.org/10.1021/ja01368a018
. [all data]
Kahlbaum, 1894
Kahlbaum, G.W.A.,
Z. Phys. Chem., Stoechiom. Verwandtschaftsl., 1894, 13, 14. [all data]
Kahlbaum, 1883
Kahlbaum, Georg W.A.,
Ueber die Abhängigkeit der Siedetemperatur vom Luftdruck,
Ber. Dtsch. Chem. Ges., 1883, 16, 2, 2476-2484, https://doi.org/10.1002/cber.188301602178
. [all data]
Kahlbaum, 1894, 2
Kahlbaum, G.W.A.,
Studien uber Dampfspannkraftsmessungen,
Z. Phys. Chem. (Leipzig), 1894, 13, 14-55. [all data]
Calis-Van Ginkel, Calis, et al., 1978
Calis-Van Ginkel, C.H.D.; Calis, G.H.M.; Timmermans, C.W.M.; de Kruif, C.G.; Oonk, H.A.J.,
Enthalpies of sublimation and dimerization in the vapour phase of formic, acetic, propanoic, and butanoic acids,
The Journal of Chemical Thermodynamics, 1978, 10, 11, 1083-1088, https://doi.org/10.1016/0021-9614(78)90082-4
. [all data]
Stull, 1947
Stull, Daniel R.,
Vapor Pressure of Pure Substances. Organic and Inorganic Compounds,
Ind. Eng. Chem., 1947, 39, 4, 517-540, https://doi.org/10.1021/ie50448a022
. [all data]
Jones, 1960
Jones, A.H.,
Sublimation Pressure Data for Organic Compounds.,
J. Chem. Eng. Data, 1960, 5, 2, 196-200, https://doi.org/10.1021/je60006a019
. [all data]
French, Ikuta, et al., 1982
French, M.A.; Ikuta, S.; Kebarle, P.,
Hydrogen bonding of O-H and C-H hydrogen donors to Cl-. Results from mass spectrometric measurement of the ion-molecule equilibria RH + Cl- = RHCl-,
Can. J. Chem., 1982, 60, 1907. [all data]
Walker and Sunderlin, 1999
Walker, B.W.; Sunderlin, L.S.,
The thermochemistry of formic acid halide anion clusters,
Int. J. Mass Spectrom., 1999, 184, 2-3, 183-189, https://doi.org/10.1016/S1387-3806(99)00008-1
. [all data]
Larson and McMahon, 1984
Larson, J.W.; McMahon, T.B.,
Hydrogen bonding in gas phase anions. An experimental investigation of the interaction between chloride ion and bronsted acids from ICR chloride exchange equilibria,
J. Am. Chem. Soc., 1984, 106, 517. [all data]
Yamdagni and Kebarle, 1971
Yamdagni, R.; Kebarle, P.,
Hydrogen bonding energies to negative ions from gas phase measurements of ionic equilibria,
J. Am. Chem. Soc., 1971, 93, 7139. [all data]
Larson and McMahon, 1984, 2
Larson, J.W.; McMahon, T.B.,
Gas phase negative ion chemistry of alkylchloroformates,
Can. J. Chem., 1984, 62, 675. [all data]
Kim, Bradforth, et al., 1995
Kim, E.H.; Bradforth, S.E.; Arnold, D.W.; Metz, R.B.; Neumark, D.M.,
Study of HCO2 and DCO2 by Negative Ion Photoelectron Spectroscopy,
J. Chem. Phys., 1995, 103, 18, 7801, https://doi.org/10.1063/1.470196
. [all data]
Caldwell, Renneboog, et al., 1989
Caldwell, G.; Renneboog, R.; Kebarle, P.,
Gas Phase Acidities of Aliphatic Carboxylic Acids, Based on Measurements of Proton Transfer Equilibria,
Can. J. Chem., 1989, 67, 4, 661, https://doi.org/10.1139/v89-092
. [all data]
Fujio, McIver, et al., 1981
Fujio, M.; McIver, R.T., Jr.; Taft, R.W.,
Effects on the acidities of phenols from specific substituent-solvent interactions. Inherent substituent parameters from gas phase acidities,
J. Am. Chem. Soc., 1981, 103, 4017. [all data]
Cumming and Kebarle, 1978
Cumming, J.B.; Kebarle, P.,
Summary of gas phase measurements involving acids AH. Entropy changes in proton transfer reactions involving negative ions. Bond dissociation energies D(A-H) and electron affinities EA(A),
Can. J. Chem., 1978, 56, 1. [all data]
Muftakhov, Vasil'ev, et al., 1999
Muftakhov, M.V.; Vasil'ev, Y.V.; Mazunov, V.A.,
Determination of electron affinity of carbonyl radicals by means of negative ion mass spectrometry,
Rapid Commun. Mass Spectrom., 1999, 13, 12, 1104-1108, https://doi.org/10.1002/(SICI)1097-0231(19990630)13:12<1104::AID-RCM619>3.0.CO;2-C
. [all data]
Larson and McMahon, 1983
Larson, J.W.; McMahon, T.B.,
Strong hydrogen bonding in gas-phase anions. An ion cyclotron resonance determination of fluoride binding energetics to bronsted acids from gas-phase fluoride exchange equilibria measurements,
J. Am. Chem. Soc., 1983, 105, 2944. [all data]
Wenthold and Squires, 1995
Wenthold, P.G.; Squires, R.R.,
Bond dissociation energies of F2(-) and HF2(-). A gas-phase experimental and G2 theoretical study,
J. Phys. Chem., 1995, 99, 7, 2002, https://doi.org/10.1021/j100007a034
. [all data]
Arshadi, Yamdagni, et al., 1970
Arshadi, M.; Yamdagni, R.; Kebarle, P.,
Hydration of Halide Negative Ions in the Gas Phase. II. Comparison of Hydration Energies for the Alkali Positive and Halide Negative Ions,
J. Phys. Chem., 1970, 74, 7, 1475, https://doi.org/10.1021/j100702a014
. [all data]
Larson and McMahon, 1982
Larson, J.W.; McMahon, T.B.,
Formation, Thermochemistry, and Relative Stabilities of Proton - Bound dimers of Oxygen n - Donor Bases from Ion Cyclotron Resonance Solvent - Exchange Equilibria Measurements,
J. Am. Chem. Soc., 1982, 104, 23, 6255, https://doi.org/10.1021/ja00387a016
. [all data]
Grimsrud and Kebarle, 1973
Grimsrud, E.P.; Kebarle, P.,
Gas Phase Ion Equilibria Studies of the Solvation of the Hydrogen Ion by Methanol, Dimethyl Ether and Water. Effect of Hydrogen Bonding,
J. Am. Chem. Soc., 1973, 95, 24, 7939, https://doi.org/10.1021/ja00805a002
. [all data]
Lias, Liebman, et al., 1984
Lias, S.G.; Liebman, J.F.; Levin, R.D.,
Evaluated gas phase basicities and proton affinities of molecules heats of formation of protonated molecules,
J. Phys. Chem. Ref. Data, 1984, 13, 695. [all data]
Keesee and Castleman, 1986
Keesee, R.G.; Castleman, A.W., Jr.,
Thermochemical data on Ggs-phase ion-molecule association and clustering reactions,
J. Phys. Chem. Ref. Data, 1986, 15, 1011. [all data]
Caldwell and Kebarle, 1984
Caldwell, G.; Kebarle, P.,
Binding energies and structural effects in halide anion-ROH and -RCOOH complexes from gas phase equilibria measurements,
J. Am. Chem. Soc., 1984, 106, 967. [all data]
Luczynski, Wlodek, et al., 1978
Luczynski, Z.; Wlodek, S.; Wincel, H.,
Stabilities of HCOO-.(HCOOH)n and Cl-.(HCOOH)n clusters,
Int. J. Mass Spectrom. Ion Phys., 1978, 26, 103. [all data]
Williamson, Knighton, et al., 1996
Williamson, D.H.; Knighton, W.B.; Grimsrud, E.P.,
Pulsed High Pressure Mass Spectrometry with Near-Viscous Flow Ion Sampling,
Int. J. Mass Spectrom. Ion Proc., 1996, 154, 1-2, 15, https://doi.org/10.1016/0168-1176(96)04372-8
. [all data]
Meot-Ner and Sieck, 1986
Meot-Ner, M.; Sieck, L.W.,
The ionic hydrogen bond and ion solvation. 5. OH...O- bonds. Gas phase solvation and clustering of alkoxide and carboxylate anions,
J. Am. Chem. Soc., 1986, 108, 7525. [all data]
Meot-Ner, 1984
Meot-Ner, (Mautner)M.,
The Ionic Hydrogen Bond and Ion Solvation. 1. -NH+ O-, -NH+ N- and -OH+ O- Bonds. Correlations with Proton Affinity. Deviations Due to Structural Effects,
J. Am. Chem. Soc., 1984, 106, 5, 1257, https://doi.org/10.1021/ja00317a015
. [all data]
Viidanoja, Reiner, et al., 2000
Viidanoja, J.; Reiner, T.; Kiendler, A.; Grimm, F.; Arnold, F.,
Laboratory investigations of negative ion molecule reactions of propionic, butyric, glyoxylic, pyruvic, and pinonic acids,
Int. J. Mass Spectrom., 2000, 194, 1, 53-68, https://doi.org/10.1016/S1387-3806(99)00172-4
. [all data]
Viidanoja, Reiner, et al., 1998
Viidanoja, J.; Reiner, T.; Arnold, F.,
Laboratory Investigations of Negative Ion-Molecule Reactions of Formic and Acetic Acid.,
Int. J. Mass Spectrom., 1998, 181, 1-3, 31, https://doi.org/10.1016/S1387-3806(98)14151-9
. [all data]
Hunter and Lias, 1998
Hunter, E.P.; Lias, S.G.,
Evaluated Gas Phase Basicities and Proton Affinities of Molecules: An Update,
J. Phys. Chem. Ref. Data, 1998, 27, 3, 413-656, https://doi.org/10.1063/1.556018
. [all data]
Traeger, 1985
Traeger, J.C.,
Heat of formation for the formyl cation by photoionization mass spectrometry,
Int. J. Mass Spectrom. Ion Processes, 1985, 66, 271. [all data]
Bell, Ng, et al., 1975
Bell, S.; Ng, T.L.; Walsh, A.D.,
Vacuum ultraviolet spectra of formic and acetic acids,
J. Chem. Soc. Faraday Trans. 2, 1975, 71, 393. [all data]
Warneck, 1974
Warneck, P.,
Heat of formation of the HCO radical,
Z. Naturforsch. A:, 1974, 29, 350. [all data]
Knowles and Nicholson, 1974
Knowles, D.J.; Nicholson, A.J.C.,
Ionization energies of formic and acetic acid monomers,
J. Chem. Phys., 1974, 60, 1180. [all data]
Watanabe, Yokoyama, et al., 1973
Watanabe, I.; Yokoyama, Y.; Ikeda, S.,
Vibrational structures in the photoelectron spectrum of formic acid,
Chem. Phys. Lett., 1973, 19, 406. [all data]
Watanabe, Yokoyama, et al., 1973, 2
Watanabe, I.; Yokoyama, Y.; Ikeda, S.,
Lone pair ionization potentials of carboxylic acids determined by He(I) photoelectron spectroscopy,
Bull. Chem. Soc. Jpn., 1973, 46, 1959. [all data]
Thomas, 1972
Thomas, R.K.,
Photoelectron spectroscopy of hydrogen-bonded systems: spectra of monomers, dimers and mixed complexes of carboxylic acides,
Proc. R. Soc. London A:, 1972, 331, 249. [all data]
Matthews and Warneck, 1969
Matthews, C.S.; Warneck, P.,
Heats of formation of CHO+ and C3H3+ by photoionization,
J. Chem. Phys. 5, 1969, 1, 854. [all data]
Brundle, Turner, et al., 1969
Brundle, C.R.; Turner, D.W.; Robin, M.B.; Basch, H.,
Photoelectron spectroscopy of simple amides and carboxylic acids,
Chem. Phys. Lett., 1969, 3, 292. [all data]
Vilesov, 1960
Vilesov, F.I.,
The photoionization of vapors of compounds whose molecules contain carbonyl groups,
Dokl. Phys. Chem., 1960, 132, 521, In original 1332. [all data]
Watanabe, 1957
Watanabe, K.,
Ionization potentials of some molecules,
J. Chem. Phys., 1957, 26, 542. [all data]
Price and Evans, 1937
Price, W.C.; Evans, W.M.,
The absorption spectrum of formic acid in the vacuum ultra-violet,
Proc. Roy. Soc. (London), 1937, A162, 110. [all data]
Von Niessen, Bieri, et al., 1980
Von Niessen, W.; Bieri, G.; Asbrink, L.,
30.4 nm He(II) photoelectron spectra of organic molecules. Part III. Oxo-compounds (C,H,O),
J. Electron Spectrosc. Relat. Phenom., 1980, 21, 175. [all data]
Benoit and Harrison, 1977
Benoit, F.M.; Harrison, A.G.,
Predictive value of proton affinity. Ionization energy correlations involving oxygenated molecules,
J. Am. Chem. Soc., 1977, 99, 3980. [all data]
Rao, 1975
Rao, C.N.R.,
Lone-pair ionization bands of chromophores in the photoelectron spectra of organic molecules,
Indian J. Chem., 1975, 13, 950. [all data]
Kimura, Katsumata, et al., 1975
Kimura, K.; Katsumata, S.; Yamazaki, T.; Wakabayashi, H.,
UV photoelectron spectra and sum rule consideration; out-of-plane orbitals of unsaturated compounds with planar-skeleton structure,
J. Electron Spectrosc. Relat. Phenom., 1975, 6, 41. [all data]
Stepanov, Perov, et al., 1988
Stepanov, A.N.; Perov, A.A.; Kabanov, S.P.; Simonov, A.P.,
Formation of long-lived, highly excited atoms during dissociative excitation of CH3CN, CH3CH2OH, CH3COOH, HCOOH, and C4H4S molecules on electron impact,
Russ. J. Phys. Chem., 1988, 22, 81. [all data]
Golovin, Akopyan, et al., 1979
Golovin, A.V.; Akopyan, M.E.; Vilesov, F.I.; Sergeev, Y.L.,
Ion-electron coincidence study of the photoionization of formic and acetic acids,
Khim. Vys. Energ., 1979, 13, 200. [all data]
Akopyan and Villem, 1976
Akopyan, M.E.; Villem, Ya.Ya.,
Ion-molecule reactions in the photoionization of formic and acetic acid vapors,
High Energy Chem., 1976, 10, 24. [all data]
Shimanouchi, 1972
Shimanouchi, T.,
Tables of Molecular Vibrational Frequencies Consolidated Volume I, National Bureau of Standards, 1972, 1-160. [all data]
Helmig, Pollock, et al., 1996
Helmig, D.; Pollock, W.; Greenberg, J.; Zimmerman, P.,
Gas chromatography mass spectrometry analysis of volatile organic trace gases at Mauna Loa Observatory, Hawaii,
J. Geophys. Res., 1996, 101, D9, 14697-14710, https://doi.org/10.1029/96JD00212
. [all data]
Peng, Yang, et al., 1991
Peng, C.T.; Yang, Z.C.; Maltby, D.,
Prediction of retention indexes. III. Silylated derivatives of polar compounds,
J. Chromatogr., 1991, 586, 1, 113-129, https://doi.org/10.1016/0021-9673(91)80029-G
. [all data]
Peng, Ding, et al., 1988
Peng, C.T.; Ding, S.F.; Hua, R.L.; Yang, Z.C.,
Prediction of Retention Indexes I. Structure-Retention Index Relationship on Apolar Columns,
J. Chromatogr., 1988, 436, 137-172, https://doi.org/10.1016/S0021-9673(00)94575-8
. [all data]
Mahajan, Goddik, et al., 2004
Mahajan, S.S.; Goddik, L.; Qian, M.C.,
Aroma Compounds in Sweet Whey Powder,
J. Dairy Sci., 2004, 87, 12, 4057-4063, https://doi.org/10.3168/jds.S0022-0302(04)73547-X
. [all data]
Natali N., Chinnici F., et al., 2006
Natali N.; Chinnici F.; Riponi C.,
Characterization of volatiles in extracts from oak chips obtained by accelerated solvent extraction (ASE),
J. Agric. Food Chem., 2006, 54, 21, 8190-8198, https://doi.org/10.1021/jf0614387
. [all data]
Yang, Chyau, et al., 1998
Yang, M.-S.; Chyau, C.-C.; Horng, D.-T.; Yang, J.-S.,
Effects of Irradiation and Drying on Volatile Components of Fresh Shiitake edodes (Lentinus Sing),
J. Sci. Food Agric., 1998, 76, 1, 72-76, https://doi.org/10.1002/(SICI)1097-0010(199801)76:1<72::AID-JSFA921>3.0.CO;2-0
. [all data]
Castel, Fernandez, et al., 2006
Castel, C.; Fernandez, X.; Lizzani-Cuvelier, L.; Loiseau, A.-M.; Perichet, C.; Delbecque, C.; Arnaudo, J.-F.,
Volatile constituents of benzoin gums: Siam and Sumatra, part 2. Study of headspace sampling methods,
Flavour Fragr. J., 2006, 21, 1, 59-67, https://doi.org/10.1002/ffj.1502
. [all data]
Zenkevich, Korolenko, et al., 1995
Zenkevich, I.G.; Korolenko, L.I.; Khralenkova, N.B.,
Desorption with solvent vapor as a method of sample preparation in the sorption preconcentration of organic-compounds from the air of a working area and from industrial-waste gases,
J. Appl. Chem. USSR (Engl. Transl.), 1995, 50, 10, 937-944. [all data]
Guo, Wu, et al., 2008
Guo, L.; Wu, J.-Z.; Han, T.; Cao, T.; Rahman, K.; Qin, L.-P.,
Chemical composition, antifungal and antitumor properties of ether extracts of Scapania verrucosa Heeg. and its endophytic fungus Chaetomium fusiforme,
Molecules, 2008, 13, 9, 2114-2125, https://doi.org/10.3390/molecules13092114
. [all data]
Prososki, Etzel, et al., 2007
Prososki, R.A.; Etzel, M.R.; Rankin, S.A.,
Solvent type affects the number, distribution, and relative quantities of volatile compounds found in sweet whey powder,
J. Dairy Sci., 2007, 90, 2, 523-531, https://doi.org/10.3168/jds.S0022-0302(07)71535-7
. [all data]
Vichi, Castellote, et al., 2003
Vichi, S.; Castellote, A.I.; Pizzale, L.; Conte, L.S.; Buxaderas, S.; López-Tamames, E.,
Analysis of virgin olive oil volatile compounds by headspace solid-phase microextraction coupled to gas chromatography with mass spectrometric and flame ionization detection,
J. Chromatogr. A, 2003, 983, 1-2, 19-33, https://doi.org/10.1016/S0021-9673(02)01691-6
. [all data]
Sekiwa, Kubota, et al., 1997
Sekiwa, Y.; Kubota, K.; Kobayashi, A.,
Characteristic flavor components in the brew of cooked clam (Meretrix lusoria) and the effect of storage on flavor formation,
J. Agric. Food Chem., 1997, 45, 3, 826-830, https://doi.org/10.1021/jf960433e
. [all data]
Umano, Hagi, et al., 1995
Umano, K.; Hagi, Y.; Nakahara, K.; Shyoji, A.; Shibamoto, T.,
Volatile chemicals formed in the headspace of a heated D-glucose/L-cysteine Maillard model system,
J. Agric. Food Chem., 1995, 43, 8, 2212-2218, https://doi.org/10.1021/jf00056a046
. [all data]
Vernin, Metzger, et al., 1988
Vernin, G.; Metzger, J.; Obretenov, T.; Suon, K.-N.; Fraisse, D.,
GC/MS (EI,PCI,SIM)-data bank analysis of volatile compounds arising from thermal degradation of glucose-valine amadori intermediates
in Flavors and Fragrances: A World Perspective. Proceedings of the 10th International Congress of Essential Oils, Fragrances and Flavors, Lawrence,B.M.; Mookherjee,B.D.; Willis,B.J., ed(s)., Elsevier, New York, 1988, 999-1028. [all data]
Gonzalez-Rios, Suarez-Quiroz, et al., 2007
Gonzalez-Rios, O.; Suarez-Quiroz, M.L.; Boulanger, R.; Barel, M.; Guyot, B.; Guiraud, J.-P.; Schorr-Galindo, S.,
Impact of ecological post-harvest processing of coffee aroma: II Roasted coffee.,
J. Food Composition Analysis, 2007, 20, 3-4, 297-307, https://doi.org/10.1016/j.jfca.2006.12.004
. [all data]
Muresan, Eillebrecht, et al., 2000
Muresan, S.; Eillebrecht, M.A.J.L.; de Rijk, T.C.; de Jonge, H.G.; Leguijt, T.; Nijhuis, H.H.,
Aroma profile development of intermediate chocolate products. I. Volatile constituents of block-milk,
Food Chem., 2000, 68, 2, 167-174, https://doi.org/10.1016/S0308-8146(99)00171-5
. [all data]