Manganese,bis[μ-(carbonothioyl)bis(η5-2,4-cyclopentadien-1-yl)-)dinitrosyldi-(mn-mn)-

Gas phase ion energetics data

Data compiled by: Sharon G. Lias, Rhoda D. Levin, and Sherif A. Kafafi

Ionization energy determinations

IE (eV) Method Reference
6.77 ± 0.02EIEfraty, Liebman, et al., 1978

Appearance energy determinations

Ion AE (eV) Other Products MethodReferenceComment
C2S2Mn2+20.92 ± 0.04?EIEfraty, Liebman, et al., 1978
C5H5Mn+21.33 ± 0.16?EIEfraty, Liebman, et al., 1978
C6H5NOSMn+11.04 ± 0.03?EIEfraty, Liebman, et al., 1978
C6H5SMn+13.00 ± 0.02?EIEfraty, Liebman, et al., 1978
C6H5SMn2+16.18 ± 0.07?EIEfraty, Liebman, et al., 1978
C7H4S2Mn+16.02 ± 0.05?EIEfraty, Liebman, et al., 1978
C7H4S2Mn2+11.87 ± 0.03?EIEfraty, Liebman, et al., 1978
C7H5NOS2Mn+9.03 ± 0.04?EIEfraty, Liebman, et al., 1978
C7H5NOS2Mn2+11.97 ± 0.02C5H5+NOEIEfraty, Liebman, et al., 1978
C7H5S2Mn2+12.89 ± 0.02C5H5+2NOEIEfraty, Liebman, et al., 1978
C10H10Mn+16.16 ± 0.03?EIEfraty, Liebman, et al., 1978
C11H10SMn2+12.64 ± 0.02CS+2NOEIEfraty, Liebman, et al., 1978
C12H10NOS2Mn2+7.90 ± 0.02NOEIEfraty, Liebman, et al., 1978
C12H10S2Mn2+8.99 ± 0.022NOEIEfraty, Liebman, et al., 1978
Mn+26.71 ± 0.03?EIEfraty, Liebman, et al., 1978
Mn2+28.38 ± 0.02?EIEfraty, Liebman, et al., 1978

References

Efraty, Liebman, et al., 1978
Efraty, A.; Liebman, D.; Huang, M.H.A.; Weston, C.A.; Angelici, R.J., Mass spectra of organometallic compounds. 7. Electron-impact study of some cyclopentadienylmetal thiocarbonyl-bridged dimers, Inorg. Chem., 1978, 17, 2831. [all data]