Benzeneethanamine
- Formula: C8H11N
- Molecular weight: 121.1796
- IUPAC Standard InChIKey: BHHGXPLMPWCGHP-UHFFFAOYSA-N
- CAS Registry Number: 64-04-0
- Chemical structure:
View 3d structure (requires JavaScript / HTML 5) - Other names: Phenethylamine; β-Aminoethylbenzene; β-Phenethylamine; β-Phenylethylamine; (2-Aminoethyl)benzene; Ethanamine, 2-phenyl-; Phenylethylamine; 1-Amino-2-phenylethane; 2-Amino-1-phenylethane; 2-Phenethylamine; 2-Phenylethylamine; Ethylamine, 2-phenyl-; Phenethylamine, β; 1-Phenyl-2-amino-athan; 1-Phenyl-2-aminoethane; 2-Amino-fenylethan; 2-Fenylethylamin; NSC 10811; 2-Phenylethanamine

Condensed phase thermochemistry data

Data compiled by: Eugene S. Domalski and Elizabeth D. Hearing
Constant pressure heat capacity of liquid
Cp,liquid (J/mol*K) | Temperature (K) | Reference |
---|---|---|
239.24 | 298.15 | Nichols and Wads, 1975 |

Phase change data

Data compiled as indicated in comments:
BS - Robert L. Brown and Stephen E. Stein
AC - William E. Acree, Jr., James S. Chickos
Quantity | Value | Units | Method | Reference | Comment |
---|---|---|---|---|---|
Tboil | 470.7 | K | N/A | Weast and Grasselli, 1989 | BS |
Quantity | Value | Units | Method | Reference | Comment |
ΔvapH° | 56.8 ± 0.2 | kJ/mol | N/A | Mokbel, Razzouk, et al., 2009 | Based on data from 277. to 351. K.; AC |
Enthalpy of vaporization
ΔvapH (kJ/mol) | Temperature (K) | Reference | Comment |
---|---|---|---|
55.7 ± 0.2 | 313. | Mokbel, Razzouk, et al., 2009 | Based on data from 277. to 351. K.; AC |

Gas phase ion energetics data

Data evaluated as indicated in comments:
HL - Edward P. Hunter and Sharon G. Lias
Data compiled as indicated in comments:
MM - Michael M. Meot-Ner (Mautner)
LLK - Sharon G. Lias, Rhoda D. Levin, and Sherif A. Kafafi
Quantity | Value | Units | Method | Reference | Comment |
---|---|---|---|---|---|
Proton affinity (review) | 936.2 | kJ/mol | N/A | Hunter and Lias, 1998 | HL |
Quantity | Value | Units | Method | Reference | Comment |
Gas basicity | 902.3 | kJ/mol | N/A | Hunter and Lias, 1998 | HL |
Gas basicity at 298K
Gas basicity (review) (kJ/mol) | Reference | Comment |
---|---|---|
900. ± 4. | Cardoso, Alexandre, et al., 1998 | cyclohexylamine; t-butylamine; MM |
Ionization energy determinations
IE (eV) | Method | Reference | Comment |
---|---|---|---|
8.5 | PE | Domelsmith, Munchausen, et al., 1977 | LLK |
8.99 ± 0.20 | PE | Domelsmith, Munchausen, et al., 1977 | Vertical value; LLK |

Kovats' RI, non-polar column, isothermal

Column type | Active phase | Temperature (C) | I | Reference | Comment |
---|---|---|---|---|---|
Packed | Apiezon L | 120. | 1103. | Donike and Stratmann, 1976 | Chromosorb W |

Kovats' RI, non-polar column, custom temperature program

Column type | Active phase | I | Reference | Comment |
---|---|---|---|---|
Packed | SE-30 | 1125. | Ramsey, Lee, et al., 1980 | He, Chromosorb G HP (80-100 mesh); Column length: 1.5 m; Program: not specified |
Packed | OV-101 | 1100. | McLinden and Stenhouse, 1979 | N2, Chromosorb W; Column length: 2. m; Program: not specified |
Packed | SE-30 | 1120. | Moffat, Stead, et al., 1974 | Column length: 2. m; Program: not specified |

Kovats' RI, polar column, isothermal

Column type | Active phase | Temperature (C) | I | Reference | Comment |
---|---|---|---|---|---|
Packed | PEG-20M | 120. | 1605. | Donike and Stratmann, 1976 | Chromosorb W |

Kovats' RI, polar column, custom temperature program

Column type | Active phase | I | Reference | Comment |
---|---|---|---|---|
Packed | Carbowax 20M | 1622. | Moffat, Stead, et al., 1974 | Column length: 1. m; Program: not specified |

Van Den Dool and Kratz RI, non-polar column, temperature ramp

Column type | Active phase | I | Reference | Comment |
---|---|---|---|---|
Capillary | OV-1 | 1069.9 | Gautzsch and Zinn, 1996 | 8. K/min; Tstart: 35. C; Tend: 300. C |
Capillary | SPB-1 | 1098. | Christ, Noomano, et al., 1988 | 30. m/0.75 mm/1.0 μm, He, 10. K/min, 280. C @ 12. min; Tstart: 160. C |
Packed | SE-30 | 1115. | Peng, Ding, et al., 1988 | He, Supelcoport and Chromosorb, 40. C @ 4. min, 10. K/min, 250. C @ 60. min; Column length: 3.05 m |
Capillary | SE-30 | 1133. | Anderson and Stafford, 1983 | 15. m/0.25 mm/0.25 μm, He, 5. K/min; Tstart: 100. C; Tend: 295. C |
Packed | SE-30 | 1120. | Perrigo and Peel, 1981 | N2, Chromosorb W, 130. C @ 2. min, 8. K/min, 290. C @ 8. min; Column length: 1.8 m |

Van Den Dool and Kratz RI, non-polar column, custom temperature program

Column type | Active phase | I | Reference | Comment |
---|---|---|---|---|
Capillary | HP-5MS | 1100.7 | Andriamaharavo, 2014 | 30. m/0.25 mm/0.25 μm, He; Program: 60C (1 min) => 5 C/min => 210C => 10 C/min => 280C (15 min) |
Capillary | Methyl Silicone | 1115. | Peng, Yang, et al., 1991 | Program: not specified |

Normal alkane RI, non-polar column, custom temperature program

Column type | Active phase | I | Reference | Comment |
---|---|---|---|---|
Capillary | Polydimethyl siloxanes | 1079. | Zenkevich and Chupalov, 1996 | Program: not specified |
Capillary | OV-1, SE-30, Methyl silicone, SP-2100, OV-101, DB-1, etc. | 1133. | Waggott and Davies, 1984 | Hydrogen; Column length: 50. m; Column diameter: 0.32 mm; Program: not specified |
Other | Methyl Silicone | 1111. | Ardrey and Moffat, 1981 | Program: not specified |

Normal alkane RI, polar column, custom temperature program

Column type | Active phase | I | Reference | Comment |
---|---|---|---|---|
Capillary | DB-Wax | 1638. | Peng, Yang, et al., 1991, 2 | Program: not specified |

References

Nichols and Wads, 1975
Nichols, N.; Wads, I.,
Thermochemistry of solutions of biochemical model compounds. 3. Some benzene derivatives in aqueous solution,
J. Chem. Thermodynam., 1975, 7, 329-336. [all data]
Weast and Grasselli, 1989
CRC Handbook of Data on Organic Compounds, 2nd Editon, Weast,R.C and Grasselli, J.G., ed(s)., CRC Press, Inc., Boca Raton, FL, 1989, 1. [all data]
Mokbel, Razzouk, et al., 2009
Mokbel, Ilham; Razzouk, Antonio; Sawaya, Terufat; Jose, Jacques,
Experimental Vapor Pressures of 2-Phenylethylamine, Benzylamine, Triethylamine, and cis -2,6-Dimethylpiperidine in the Range between 0.2 Pa and 75 kPa,
J. Chem. Eng. Data, 2009, 54, 3, 819-822, https://doi.org/10.1021/je800603z
. [all data]
Hunter and Lias, 1998
Hunter, E.P.; Lias, S.G.,
Evaluated Gas Phase Basicities and Proton Affinities of Molecules: An Update,
J. Phys. Chem. Ref. Data, 1998, 27, 3, 413-656, https://doi.org/10.1063/1.556018
. [all data]
Cardoso, Alexandre, et al., 1998
Cardoso, A.M.; Alexandre, S.M.G.; Barros, C.M.F.; Ferrer-Correia, A.J.; Nibbering, N.M.M.,
Proton Affinities of Phenylalkylamines by the Kinetic Method,
Int. J. Mass Spectrom. Ion. Processes, 1998, 172, 123. [all data]
Domelsmith, Munchausen, et al., 1977
Domelsmith, L.N.; Munchausen, L.L.; Houk, K.N.,
Photoelectron spectra of psychotropic drugs. 1. Phenethylamines, tryptamines, and LSD,
J. Am. Chem. Soc., 1977, 99, 4311. [all data]
Donike and Stratmann, 1976
Donike, M.; Stratmann, D.,
Gas-chromatographische identifizierung von stimulantien der phenyläthylaminreihe mit hilfe der retnetions-indices,
Z. Anal. Chem., 1976, 279, 2, 129-131, https://doi.org/10.1007/BF00440798
. [all data]
Ramsey, Lee, et al., 1980
Ramsey, J.D.; Lee, T.D.; Osselton, M.D.; Moffat, A.C.,
Gas-liquid chromatographic retention indices of 296 non-drug substances on SE-30 or OV-1 likely to be encountered in toxicological analyses,
J. Chromatogr., 1980, 184, 2, 185-206, https://doi.org/10.1016/S0021-9673(00)85641-1
. [all data]
McLinden and Stenhouse, 1979
McLinden, V.J.; Stenhouse, A.M.,
A chromatography system for drug identification,
Forensic Sci. Int., 1979, 13, 71-79, https://doi.org/10.1016/0379-0738(79)90265-2
. [all data]
Moffat, Stead, et al., 1974
Moffat, A.C.; Stead, A.H.; Smalldon, K.W.,
Optimum use of paper, thin-layer and gas-liquid chromatography for the identification of basic drugs. III. Gas-liquid chromatography,
J. Chromatogr., 1974, 90, 1, 19-33, https://doi.org/10.1016/S0021-9673(01)94770-3
. [all data]
Gautzsch and Zinn, 1996
Gautzsch, R.; Zinn, P.,
Use of incremental models to estimate the retention indexes of aromatic compounds,
Chromatographia, 1996, 43, 3/4, 163-176, https://doi.org/10.1007/BF02292946
. [all data]
Christ, Noomano, et al., 1988
Christ, D.W.; Noomano, P.; Rosas, M.; Rhone, D.,
Retention indices by wide-bore capillary gas chromatography with nitrogen-phosphorus detection,
J. Anal. Toxicol., 1988, 12, 2, 84-88, https://doi.org/10.1093/jat/12.2.84
. [all data]
Peng, Ding, et al., 1988
Peng, C.T.; Ding, S.F.; Hua, R.L.; Yang, Z.C.,
Prediction of Retention Indexes I. Structure-Retention Index Relationship on Apolar Columns,
J. Chromatogr., 1988, 436, 137-172, https://doi.org/10.1016/S0021-9673(00)94575-8
. [all data]
Anderson and Stafford, 1983
Anderson, W.H.; Stafford, D.T.,
Applications of capillary gas chromatography in routine toxicological analyses,
J. Hi. Res. Chromatogr. Chromatogr. Comm., 1983, 6, 5, 247-254, https://doi.org/10.1002/jhrc.1240060506
. [all data]
Perrigo and Peel, 1981
Perrigo, B.J.; Peel, H.W.,
The use of retention indices and temperature-programmed gas chromatography in analytical toxicology,
J. Chromatogr. Sci., 1981, 19, 5, 219-226, https://doi.org/10.1093/chromsci/19.5.219
. [all data]
Andriamaharavo, 2014
Andriamaharavo, N.R.,
Retention Data. NIST Mass Spectrometry Data Center., NIST Mass Spectrometry Data Center, 2014. [all data]
Peng, Yang, et al., 1991
Peng, C.T.; Yang, Z.C.; Maltby, D.,
Prediction of retention indexes. III. Silylated derivatives of polar compounds,
J. Chromatogr., 1991, 586, 1, 113-129, https://doi.org/10.1016/0021-9673(91)80029-G
. [all data]
Zenkevich and Chupalov, 1996
Zenkevich, I.G.; Chupalov, A.A.,
New Possibilities of Chromato Mass Pectrometric Identification of Organic Compounds Using Increments of Gas Chromatographic Retention Indices of Molecular Structural Fragments,
Zh. Org. Khim. (Rus.), 1996, 32, 5, 656-666. [all data]
Waggott and Davies, 1984
Waggott, A.; Davies, I.W.,
Identification of organic pollutants using linear temperature programmed retention indices (LTPRIs) - Part II, 1984, retrieved from http://dwi.defra.gov.uk/research/completed-research/reports/dwi0383.pdf. [all data]
Ardrey and Moffat, 1981
Ardrey, R.E.; Moffat, A.C.,
Gas-liquid chromatographic retention indices of 1318 substances of toxicological interest on SE-30 or OV-1 stationary phase,
J. Chromatogr., 1981, 220, 3, 195-252, https://doi.org/10.1016/S0021-9673(00)81925-1
. [all data]
Peng, Yang, et al., 1991, 2
Peng, C.T.; Yang, Z.C.; Ding, S.F.,
Prediction of rentention idexes. II. Structure-retention index relationship on polar columns,
J. Chromatogr., 1991, 586, 1, 85-112, https://doi.org/10.1016/0021-9673(91)80028-F
. [all data]