Hexa-2,4-diyne-d6

Gas phase ion energetics data

Data compiled by: Sharon G. Lias, Rhoda D. Levin, and Sherif A. Kafafi

Appearance energy determinations

Ion AE (eV) Other Products MethodReferenceComment
C4D2+≤13.9 ± 0.1C2D4PIPECODannacher, Stadelmann, et al., 1981

References

Dannacher, Stadelmann, et al., 1981
Dannacher, J.; Stadelmann, J.P.; Vogt, J., Competition between dissociative and nondissociative decay of excited perdeutero-2,4-hexadiyne cations, J. Chem. Phys., 1981, 74, 2094. [all data]