Dysprosium monochloride

Gas phase ion energetics data

Data compiled by: Sharon G. Lias, John E. Bartmess, Joel F. Liebman, John L. Holmes, Rhoda D. Levin, and W. Gary Mallard

Appearance energy determinations

Ion AE (eV) Other Products MethodReferenceComment
Dy+19.86 ± 0.08ClEISapegin, Baluev, et al., 1984

References

Sapegin, Baluev, et al., 1984
Sapegin, A.M.; Baluev, A.V.; Evdokimov, V.I., Mass-spectrometric investigation of the thermochemistry of the chlorides of the lanthanides, Russ. J. Phys. Chem., 1984, 58, 1792. [all data]