Thiophene, 2,5-dimethyl-
- Formula: C6H8S
- Molecular weight: 112.193
- IUPAC Standard InChIKey: GWQOOADXMVQEFT-UHFFFAOYSA-N
- CAS Registry Number: 638-02-8
- Chemical structure:
View 3d structure (requires JavaScript / HTML 5) - Other names: 2,5-Dimethylthiophene

Condensed phase thermochemistry data

Data compiled by: Eugene S. Domalski and Elizabeth D. Hearing
Quantity | Value | Units | Method | Reference | Comment |
---|---|---|---|---|---|
S°liquid | 244.72 | J/mol*K | N/A | Carlson and Westrum, 1965 |
Constant pressure heat capacity of liquid
Cp,liquid (J/mol*K) | Temperature (K) | Reference | Comment |
---|---|---|---|
178.32 | 298.15 | Carlson and Westrum, 1965 | T = 5 to 305 K. |

Phase change data

Data compiled as indicated in comments:
BS - Robert L. Brown and Stephen E. Stein
TRC - Thermodynamics Research Center, NIST Boulder Laboratories, Chris Muzny director
AC - William E. Acree, Jr., James S. Chickos
DH - Eugene S. Domalski and Elizabeth D. Hearing
Quantity | Value | Units | Method | Reference | Comment |
---|---|---|---|---|---|
Tboil | 409.7 | K | N/A | Weast and Grasselli, 1989 | BS |
Quantity | Value | Units | Method | Reference | Comment |
Ttriple | 204.87 | K | N/A | Carlson and Westrum, 1965, 2 | Metastable crystal phase; Uncertainty assigned by TRC = 0.06 K; TRC |
Ttriple | 210.58 | K | N/A | Carlson and Westrum, 1965, 2 | Uncertainty assigned by TRC = 0.03 K; TRC |
Quantity | Value | Units | Method | Reference | Comment |
ΔvapH° | 40.2 ± 0.9 | kJ/mol | C | Ribeiro da Silva and Santos, 2008 | AC |
Reduced pressure boiling point
Tboil (K) | Pressure (bar) | Reference | Comment |
---|---|---|---|
407.2 | 0.987 | Aldrich Chemical Company Inc., 1990 | BS |
Enthalpy of vaporization
ΔvapH (kJ/mol) | Temperature (K) | Method | Reference | Comment |
---|---|---|---|---|
39.7 | 348. | IA | Stephenson and Malanowski, 1987 | Based on data from 333. to 374. K. See also Eon, Pommier, et al., 1971 and Dykyj, Svoboda, et al., 1999.; AC |
Antoine Equation Parameters
log10(P) = A − (B / (T + C))
P = vapor pressure (bar)
T = temperature (K)
View plot Requires a JavaScript / HTML 5 canvas capable browser.
Temperature (K) | A | B | C | Reference | Comment |
---|---|---|---|---|---|
333.4 to 373.5 | 4.8737 | 1925.967 | -12.704 | Eon, Pommier, et al., 1971 | Coefficents calculated by NIST from author's data. |
Enthalpy of fusion
ΔfusH (kJ/mol) | Temperature (K) | Reference | Comment |
---|---|---|---|
8.91 | 210.6 | Domalski and Hearing, 1996 | AC |
Enthalpy of phase transition
ΔHtrs (kJ/mol) | Temperature (K) | Initial Phase | Final Phase | Reference | Comment |
---|---|---|---|---|---|
8.1910 | 210.58 | crystaline, I | liquid | Carlson and Westrum, 1965 | DH |
7.4011 | 204.87 | crystaline, II | liquid | Carlson and Westrum, 1965 | Metastable crystals. Note error in table on Hm and Tm.; DH |
Entropy of phase transition
ΔStrs (J/mol*K) | Temperature (K) | Initial Phase | Final Phase | Reference | Comment |
---|---|---|---|---|---|
38.90 | 210.58 | crystaline, I | liquid | Carlson and Westrum, 1965 | DH |
36.12 | 204.87 | crystaline, II | liquid | Carlson and Westrum, 1965 | Metastable; DH |

Gas phase ion energetics data

Data compiled as indicated in comments:
LBLHLM - Sharon G. Lias, John E. Bartmess, Joel F. Liebman, John L. Holmes, Rhoda D. Levin, and W. Gary Mallard
LLK - Sharon G. Lias, Rhoda D. Levin, and Sherif A. Kafafi
Ionization energy determinations
IE (eV) | Method | Reference | Comment |
---|---|---|---|
8.10 | EI | Aloisi and Pignataro, 1973 | LLK |
8.18 | CTS | Aloisi and Pignataro, 1973 | LLK |
8.23 | PE | Bock and Roth, 1983 | Vertical value; LBLHLM |
8.09 | PE | Schweig and Thiel, 1974 | Vertical value; LLK |

Van Den Dool and Kratz RI, polar column, custom temperature program

Data compiled by: NIST Mass Spectrometry Data Center, William E. Wallace, director

Column type CapillaryCapillary
Active phase Supelcowax-10Supelcowax-10
Column length (m) 30.30.
Carrier gas HeHe
Substrate
Column diameter (mm) 0.250.25
Phase thickness (μm) 0.250.25
Program 40C(1min) => 10C/min => 120C => 15C/min => 200C (1min)35C(8min) => 4C/min => 60C => 6C/min => 160C => 20C/min => 200C(1min)
I 1168.1162.
ReferenceBianchi, Careri, et al., 2007Bianchi, Careri, et al., 2007
Comment MSDC-RI MSDC-RI

Normal alkane RI, non-polar column, temperature ramp

Data compiled by: NIST Mass Spectrometry Data Center, William E. Wallace, director

Column type CapillaryCapillaryCapillaryCapillaryCapillary
Active phase DB-5PONAPONAPONADB-1
Column length (m) 30.50.50.50.60.
Carrier gas HeliumN2 HeliumHe
Substrate
Column diameter (mm) 0.250.200.200.200.32
Phase thickness (μm) 0.250.500.500.501.0
Tstart (C) 50.35.30.30.40.
Tend (C) 220.170.150.170.280.
Heat rate (K/min) 4.2.2.2.2.
Initial hold (min)
Final hold (min)
I 876.856.850.853.859.
ReferenceShedid, 2010Yang, Wang, et al., 2004Yang, Wang, et al., 2003Yang, Yang, et al., 2003Tai and Ho, 1998
Comment MSDC-RI MSDC-RI MSDC-RI MSDC-RI MSDC-RI
Column type CapillaryCapillaryCapillaryCapillaryCapillary
Active phase OV-101OV-101CP-Sil 5CP-Sil 5CP Sil 5 CB
Column length (m) 50.50.25.25.25.
Carrier gas NitrogenNitrogenHeliumHeliumHe
Substrate
Column diameter (mm) 0.250.250.320.320.32
Phase thickness (μm)   0.450.450.45
Tstart (C) 70.80.0.0.50.
Tend (C) 200.200.300.300.300.
Heat rate (K/min) 2.2.3.3.3.
Initial hold (min)   5.5.
Final hold (min)
I 868.866.852.852.852.
ReferenceSugisawa, Nakamura, et al., 1990Sugisawa, Nakamura, et al., 1990Damste, van Dalen, et al., 1988Damste, van Dalen, et al., 1988Damste, Kock-van Dalen, et al., 1988
Comment MSDC-RI MSDC-RI MSDC-RI MSDC-RI MSDC-RI
Column type Capillary
Active phase CP Sil 5 CB
Column length (m) 25.
Carrier gas He
Substrate
Column diameter (mm) 0.32
Phase thickness (μm) 0.45
Tstart (C) 50.
Tend (C) 300.
Heat rate (K/min) 3.
Initial hold (min)
Final hold (min)
I 852.
ReferenceDamste, Kock-van Dalen, et al., 1988
Comment MSDC-RI

Kovats' RI, non-polar column, isothermal

Data compiled by: NIST Mass Spectrometry Data Center, William E. Wallace, director

Column type CapillaryCapillaryCapillaryPackedPacked
Active phase SPB-1SE-30OV-101Apiezon MApiezon M
Column length (m) 60.60.60.2.12.1
Carrier gas  HeHeHe or N2
Substrate    Chromosorb W, AW-DMCSChromosorb W, AW/DMS
Column diameter (mm) 0.320.250.25
Phase thickness (μm) 0.250.500.50
Temperature (C) 100.100.100.130.130.
I 864.865.863.891.891.
ReferenceMisharina, Beletsky, et al., 1994Golovnya, Misharina, et al., 1992Golovnya, Misharina, et al., 1992Garbuzov, Misharina, et al., 1985Golovnya, Garbuzov, et al., 1978
Comment MSDC-RI MSDC-RI MSDC-RI MSDC-RI MSDC-RI
Column type CapillaryCapillaryCapillaryCapillaryCapillary
Active phase Apiezon LSqualaneSqualaneSqualaneSqualane
Column length (m)    50.50.
Carrier gas    N2N2
Substrate    Celite 545Celite 545
Column diameter (mm)    0.30.3
Phase thickness (μm)
Temperature (C) 120.120.86.120.86.
I 894.845.840.845.840.
ReferenceAgr, Tesaric, et al., 1973Agr, Tesaric, et al., 1973Agr, Tesaric, et al., 1973Agrawal, Tesarík, et al., 1972Agrawal, Tesarík, et al., 1972
Comment MSDC-RI MSDC-RI MSDC-RI MSDC-RI MSDC-RI
Column type Capillary
Active phase Apiezon L
Column length (m) 100.
Carrier gas N2
Substrate
Column diameter (mm) 0.3
Phase thickness (μm)
Temperature (C) 120.
I 894.
ReferenceAgrawal, Tesarík, et al., 1972
Comment MSDC-RI

References

Carlson and Westrum, 1965
Carlson, H.G.; Westrum, E.F., Jr.,
2,5-Dimethylthiophene. Heat capacities and thermodynamic properties from 5 to 300 K and fusion of stable and metastable phases,
J. Phys. Chem., 1965, 68, 1524-1530. [all data]
Weast and Grasselli, 1989
CRC Handbook of Data on Organic Compounds, 2nd Editon, Weast,R.C and Grasselli, J.G., ed(s)., CRC Press, Inc., Boca Raton, FL, 1989, 1. [all data]
Carlson and Westrum, 1965, 2
Carlson, H.G.; Westrum, E.F.,
2,5-Dimethylthiopnehe. Heat Capacities and Thermodynamic Properties from 5 to 300 K and Fusion of Stable and Metastable Phases,
J. Phys. Chem., 1965, 69, 1524. [all data]
Ribeiro da Silva and Santos, 2008
Ribeiro da Silva, Manuel A.V.; Santos, Ana Filipa L.O.M.,
Experimental study on the thermochemistry of 2,5-dimethylthiophene and its acetyl derivative,
The Journal of Chemical Thermodynamics, 2008, 40, 8, 1217-1221, https://doi.org/10.1016/j.jct.2008.04.005
. [all data]
Aldrich Chemical Company Inc., 1990
Aldrich Chemical Company Inc.,
Catalog Handbook of Fine Chemicals, Aldrich Chemical Company, Inc., Milwaukee WI, 1990, 1. [all data]
Stephenson and Malanowski, 1987
Stephenson, Richard M.; Malanowski, Stanislaw,
Handbook of the Thermodynamics of Organic Compounds, 1987, https://doi.org/10.1007/978-94-009-3173-2
. [all data]
Eon, Pommier, et al., 1971
Eon, C.; Pommier, C.; Guiochon, G.,
Vapor pressures and second virial coefficients of some five-membered heterocyclic derivatives,
J. Chem. Eng. Data, 1971, 16, 4, 408-410, https://doi.org/10.1021/je60051a008
. [all data]
Dykyj, Svoboda, et al., 1999
Dykyj, J.; Svoboda, J.; Wilhoit, R.C.; Frenkel, M.L.; Hall, K.R.,
Vapor Pressure of Chemicals: Part A. Vapor Pressure and Antoine Constants for Hydrocarbons and Sulfur, Selenium, Tellurium and Hydrogen Containing Organic Compounds, Springer, Berlin, 1999, 373. [all data]
Domalski and Hearing, 1996
Domalski, Eugene S.; Hearing, Elizabeth D.,
Heat Capacities and Entropies of Organic Compounds in the Condensed Phase. Volume III,
J. Phys. Chem. Ref. Data, 1996, 25, 1, 1, https://doi.org/10.1063/1.555985
. [all data]
Aloisi and Pignataro, 1973
Aloisi, G.G.; Pignataro, S.,
Molecular complexes of substituted thiophens with σ and π acceptors,
J. Chem. Soc. Faraday Trans. 1, 1973, 69, 534. [all data]
Bock and Roth, 1983
Bock, H.; Roth, B.,
Radical ions. 49. Redox reactions of some thiophene derivatives,
Phosphorus Sulfur, 1983, 14, 211. [all data]
Schweig and Thiel, 1974
Schweig, A.; Thiel, W.,
Photoionization cross sections: He I- and He II-photoelectron spectra of homologous oxygen and sulphur compounds,
Mol. Phys., 1974, 27, 265. [all data]