1,4-Cyclohexanedione
- Formula: C6H8O2
- Molecular weight: 112.1265
- IUPAC Standard InChIKey: DCZFGQYXRKMVFG-UHFFFAOYSA-N
- CAS Registry Number: 637-88-7
- Chemical structure:
View 3d structure (requires JavaScript / HTML 5) - Other names: Tetrahydroquinone; 1,4-Dioxocyclohexane; Cyclohexane-1,4-dione

Gas phase thermochemistry data

Data compiled by: Hussein Y. Afeefy, Joel F. Liebman, and Stephen E. Stein
Quantity | Value | Units | Method | Reference | Comment |
---|---|---|---|---|---|
ΔfH°gas | -332.6 ± 1.2 | kJ/mol | Ccb | Pilcher, Parchment, et al., 1993 |

Condensed phase thermochemistry data

Data compiled as indicated in comments:
ALS - Hussein Y. Afeefy, Joel F. Liebman, and Stephen E. Stein
DH - Eugene S. Domalski and Elizabeth D. Hearing
Quantity | Value | Units | Method | Reference | Comment |
---|---|---|---|---|---|
ΔfH°solid | -407.6 ± 1.0 | kJ/mol | Ccb | Pilcher, Parchment, et al., 1993 | ALS |
Quantity | Value | Units | Method | Reference | Comment |
ΔcH°solid | -3096.8 ± 0.6 | kJ/mol | Ccb | Pilcher, Parchment, et al., 1993 | Corresponding ΔfHºsolid = -407.6 kJ/mol (simple calculation by NIST; no Washburn corrections); ALS |
Constant pressure heat capacity of solid
Cp,solid (J/mol*K) | Temperature (K) | Reference | Comment |
---|---|---|---|
161.4 | 300. | DeWit, DeKruif, et al., 1983 | T = 90 to 310 K. Linearly extrapolated.; DH |

Phase change data

Data compiled as indicated in comments:
TRC - Thermodynamics Research Center, NIST Boulder Laboratories, Chris Muzny director
ALS - Hussein Y. Afeefy, Joel F. Liebman, and Stephen E. Stein
AC - William E. Acree, Jr., James S. Chickos
DH - Eugene S. Domalski and Elizabeth D. Hearing
CAL - James S. Chickos, William E. Acree, Jr., Joel F. Liebman, Students of Chem 202 (Introduction to the Literature of Chemistry), University of Missouri -- St. Louis
Quantity | Value | Units | Method | Reference | Comment |
---|---|---|---|---|---|
Tfus | 350. | K | N/A | Alvik, Borgen, et al., 1972 | Crystal phase 1 phase; Uncertainty assigned by TRC = 1. K; TRC |
Tfus | 351.15 | K | N/A | Hartley and Dobbie, 1898 | Uncertainty assigned by TRC = 1. K; TRC |
Quantity | Value | Units | Method | Reference | Comment |
Ttriple | 351.6 | K | N/A | De Wit, De Kruif, et al., 1983 | Crystal phase 1 phase; Uncertainty assigned by TRC = 0.2 K; TRC |
Quantity | Value | Units | Method | Reference | Comment |
ΔsubH° | 75.0 ± 1.0 | kJ/mol | V | Pilcher, Parchment, et al., 1993 | ALS |
ΔsubH° | 75.0 ± 1.0 | kJ/mol | C | Pilcher, Parchment, et al., 1993 | AC |
ΔsubH° | 84.2 | kJ/mol | N/A | De Wit, Van Miltenburg, et al., 1983 | AC |
Enthalpy of sublimation
ΔsubH (kJ/mol) | Temperature (K) | Method | Reference | Comment |
---|---|---|---|---|
75.000 | 298.15 | N/A | Pilcher, Parchment, et al., 1993 | DH |
84.4 | 289. | TE,ME | De Wit, Van Miltenburg, et al., 1983 | AC |
Enthalpy of fusion
ΔfusH (kJ/mol) | Temperature (K) | Reference | Comment |
---|---|---|---|
11.26 | 351.5 | De Wit, De Kruif, et al., 1983, 2 | AC |
10.04 | 348.2 | Alvik, Borgen, et al., 1972, 2 | AC |
Entropy of fusion
ΔfusS (J/mol*K) | Temperature (K) | Reference | Comment |
---|---|---|---|
19.09 | 322.2 | Alvik, Borgen, et al., 1972 | CAL |
2.83 | 339.2 | ||
28.84 | 348.2 |
Temperature of phase transition
Ttrs (K) | Initial Phase | Final Phase | Reference | Comment |
---|---|---|---|---|
319.89 | crystaline, III | crystaline, II | DeWit, DeKruif, et al., 1983 | DH |
336.73 | crystaline, II | crystaline, I | DeWit, DeKruif, et al., 1983 | DH |
Enthalpy of phase transition
ΔHtrs (kJ/mol) | Temperature (K) | Initial Phase | Final Phase | Reference | Comment |
---|---|---|---|---|---|
11.325 | 351.6 | crystaline, I | liquid | DeWit, DeKruif, et al., 1983 | DH |

Gas phase ion energetics data

Data evaluated as indicated in comments:
HL - Edward P. Hunter and Sharon G. Lias
Data compiled as indicated in comments:
LLK - Sharon G. Lias, Rhoda D. Levin, and Sherif A. Kafafi
Quantity | Value | Units | Method | Reference | Comment |
---|---|---|---|---|---|
Proton affinity (review) | 812.5 | kJ/mol | N/A | Hunter and Lias, 1998 | HL |
Quantity | Value | Units | Method | Reference | Comment |
Gas basicity | 782.7 | kJ/mol | N/A | Hunter and Lias, 1998 | HL |
Ionization energy determinations
IE (eV) | Method | Reference | Comment |
---|---|---|---|
9.85 | PE | Dougherty, Brint, et al., 1978 | Vertical value; LLK |
9.65 | PE | Cowan, Gleiter, et al., 1971 | Vertical value; LLK |

Normal alkane RI, polar column, temperature ramp

Column type | Active phase | I | Reference | Comment |
---|---|---|---|---|
Capillary | DB-Wax | 1975. | Moon and Shibamoto, 2010 | 60. m/0.25 mm/0.50 μm, Helium, 40. C @ 5. min, 2. K/min, 210. C @ 70. min |

References

Pilcher, Parchment, et al., 1993
Pilcher, G.; Parchment, O.G.; Hillier, I.H.; Heatley, F.; Fletcher, D.; Ribeiro da Silva, M.A.V.; Ferrao, M.L.C.C.H.; Monte, J.S.; Jiye, F.,
Thermochemical and theoretical studies on cyclohexanediones,
J. Phys. Chem., 1993, 97, 243-247. [all data]
DeWit, DeKruif, et al., 1983
DeWit, H.G.M.; DeKruif, C.G.; Van Miltenburg, J.C.,
Thermodynamic properties of molecular organic crystals containing organic crystals containing nitrogen, oxygen, and sulfur. II. Molar heat capacities of eight compounds by adiabatic calorimetry,
J. Chem. Thermodynam., 1983, 15, 891-902. [all data]
Alvik, Borgen, et al., 1972
Alvik, T.; Borgen, G.; Dale, J.,
Conformational Studies of Normal, Medium, and Large Ring Diametric Cycloalkanediones and Their Ethylene Ketal Derivatives.,
Acta Chem. Scand., 1972, 26, 1805, https://doi.org/10.3891/acta.chem.scand.26-1805
. [all data]
Hartley and Dobbie, 1898
Hartley, W.N.; Dobbie, J.J.,
The ultraviolet absorption spectra of some closed chain carbon compounds,
J. Chem. Soc., 1898, 73, 598. [all data]
De Wit, De Kruif, et al., 1983
De Wit, H.G.M.; De Kruif, C.G.; Van Miltenburg, J.C.,
Thermodynamic properties of molecular organic crystals containing nitrogen, oxygen, and sulfur II. Molar heat capacities of eight compounds by adiabatic calorimetry,
J. Chem. Thermodyn., 1983, 15, 9, 891, https://doi.org/10.1016/0021-9614(83)90095-2
. [all data]
De Wit, Van Miltenburg, et al., 1983
De Wit, H.G.M.; Van Miltenburg, J.C.; De Kruif, C.G.,
Thermodynamic properties of molecular organic crystals containing nitrogen, oxygen, and sulphur 1. Vapour pressures and enthalpies of sublimation,
The Journal of Chemical Thermodynamics, 1983, 15, 7, 651-663, https://doi.org/10.1016/0021-9614(83)90079-4
. [all data]
De Wit, De Kruif, et al., 1983, 2
De Wit, H.G.M.; De Kruif, C.G.; Van Miltenburg, J.C.,
Thermodynamic properties of molecular organic crystals containing nitrogen, oxygen, and sulfur II. Molar heat capacities of eight compounds by adiabatic calorimetry,
The Journal of Chemical Thermodynamics, 1983, 15, 9, 891-902, https://doi.org/10.1016/0021-9614(83)90095-2
. [all data]
Alvik, Borgen, et al., 1972, 2
Alvik, Thor; Borgen, Gerd; Dale, Johannes; Øye, H.A.; Svensson, Sigfrid,
Conformational Studies of Normal, Medium, and Large Ring Diametric Cycloalkanediones and Their Ethylene Ketal Derivatives.,
Acta Chem. Scand., 1972, 26, 1805-1816, https://doi.org/10.3891/acta.chem.scand.26-1805
. [all data]
Hunter and Lias, 1998
Hunter, E.P.; Lias, S.G.,
Evaluated Gas Phase Basicities and Proton Affinities of Molecules: An Update,
J. Phys. Chem. Ref. Data, 1998, 27, 3, 413-656, https://doi.org/10.1063/1.556018
. [all data]
Dougherty, Brint, et al., 1978
Dougherty, D.; Brint, P.; McGlynn, S.P.,
Photoelectron spectroscopy of carbonyls. Lone-pair interactions in α-, β-, γ δ-dicarbonyls,
J. Am. Chem. Soc., 1978, 100, 5597. [all data]
Cowan, Gleiter, et al., 1971
Cowan, D.O.; Gleiter, R.; Hashmall, J.A.; Heilbronner, E.; Hornung, V.,
Interaction between the orbitals of lone pair electrons in dicarbonyl compounds,
Angew. Chem. Int. Ed. Engl., 1971, 10, 401. [all data]
Moon and Shibamoto, 2010
Moon, J.-K.; Shibamoto, T.,
Formation of volatile chemicals from thermal degradation of less volatile cofee components: quinic acid, caffeic acid, and chlorogenic acid,
J. Agric. Food Chem., 2010, 58, 9, 5465-5470, https://doi.org/10.1021/jf1005148
. [all data]