p-Tolyl ethyl sulfoxide
- Formula: C9H12OS
- Molecular weight: 168.256
- IUPAC Standard InChIKey: OHXBXXWDEOXULA-UHFFFAOYSA-N
- CAS Registry Number: 6378-07-0
- Chemical structure:
View 3d structure (requires JavaScript / HTML 5) - Permanent link for this species. Use this link for bookmarking this species for future reference.

Gas phase ion energetics data

Data compiled as indicated in comments:
LLK - Sharon G. Lias, Rhoda D. Levin, and Sherif A. Kafafi
Ionization energy determinations
IE (eV) | Method | Reference | Comment |
---|---|---|---|
8.56 | PE | Mohraz, Jian-qi, et al., 1981 | Vertical value; LLK |

References

Mohraz, Jian-qi, et al., 1981
Mohraz, M.; Jian-qi, W.; Heilbronner, E.; Solladie-Cavallo, A.; Matloubi-Moghadam, F.,
11. Some comments on the conformations of methyl phenyl sulfides, sulfoxides and sulfones,
Helv. Chim. Acta, 1981, 64, 97. [all data]