(CH3)2Si
- Formula: C2H6Si
- Molecular weight: 58.1545
- IUPAC Standard InChIKey: JZZIHCLFHIXETF-UHFFFAOYSA-N
- CAS Registry Number: 6376-86-9
- Chemical structure:
View 3d structure (requires JavaScript / HTML 5) - Permanent link for this species. Use this link for bookmarking this species for future reference.

Reaction thermochemistry data

Data compiled by: John E. Bartmess
Individual Reactions
C2H5Si- + =
By formula: C2H5Si- + H+ = C2H6Si
Quantity | Value | Units | Method | Reference | Comment |
---|---|---|---|---|---|
ΔrH° | 1593. ± 21. | kJ/mol | G+TS | Damrauer, DePuy, et al., 1986 | gas phase; May have rearranged to 2-sila-allyl anion: G3MP2B3 calculations indicate an acidity of 361 kcal/mol |
Quantity | Value | Units | Method | Reference | Comment |
ΔrG° | 1565. ± 21. | kJ/mol | IMRB | Damrauer, DePuy, et al., 1986 | gas phase; May have rearranged to 2-sila-allyl anion: G3MP2B3 calculations indicate an acidity of 361 kcal/mol |

Gas phase ion energetics data

Data compiled by: John E. Bartmess
De-protonation reactions
C2H5Si- + =
By formula: C2H5Si- + H+ = C2H6Si
Quantity | Value | Units | Method | Reference | Comment |
---|---|---|---|---|---|
ΔrH° | 1593. ± 21. | kJ/mol | G+TS | Damrauer, DePuy, et al., 1986 | gas phase; May have rearranged to 2-sila-allyl anion: G3MP2B3 calculations indicate an acidity of 361 kcal/mol |
Quantity | Value | Units | Method | Reference | Comment |
ΔrG° | 1565. ± 21. | kJ/mol | IMRB | Damrauer, DePuy, et al., 1986 | gas phase; May have rearranged to 2-sila-allyl anion: G3MP2B3 calculations indicate an acidity of 361 kcal/mol |

Vibrational and/or electronic energy levels

Data compiled by: Marilyn E. Jacox
State: ?
Energy (cm-1) |
Med. | Transition | λmin (nm) |
λmax (nm) |
References | ||
---|---|---|---|---|---|---|---|
Txd = 22200 | Ar | Drahnak, Michl, et al., 1979 | |||||
Drahnak, Michl, et al., 1981 | |||||||
Arrington, Klingensmith, et al., 1984 | |||||||
Maier, Mihm, et al., 1984 | |||||||
State: ?
Energy (cm-1) |
Med. | Transition | λmin (nm) |
λmax (nm) |
References | ||
---|---|---|---|---|---|---|---|
Txd = 22200 | N2 | Drahnak, Michl, et al., 1979 | |||||
Drahnak, Michl, et al., 1981 | |||||||
Arrington, Klingensmith, et al., 1984 | |||||||
Maier, Mihm, et al., 1984 | |||||||
State: X
Additional references: Jacox, 1994, page 399

References

Damrauer, DePuy, et al., 1986
Damrauer, R.; DePuy, C.H.; Davidson, I.M.T.; Hughes, K.J.,
Gas phase ion chemistry of dimethylsilylene,
Organometallics, 1986, 5, 2054. [all data]
Drahnak, Michl, et al., 1979
Drahnak, T.J.; Michl, J.; West, R.,
Dimethylsilylene, (CH3)2Si,
J. Am. Chem. Soc., 1979, 101, 18, 5427, https://doi.org/10.1021/ja00512a059
. [all data]
Drahnak, Michl, et al., 1981
Drahnak, T.J.; Michl, J.; West, R.,
Photoisomerization of dimethylsilylene to 2-silapropene and thermal reversion to dimethylsilylene,
J. Am. Chem. Soc., 1981, 103, 7, 1845, https://doi.org/10.1021/ja00397a047
. [all data]
Arrington, Klingensmith, et al., 1984
Arrington, C.A.; Klingensmith, K.A.; West, R.; Michl, J.,
Polarized infrared spectroscopy of matrix-isolated dimethylsilylene and 1-methylsilene,
J. Am. Chem. Soc., 1984, 106, 3, 525, https://doi.org/10.1021/ja00315a010
. [all data]
Maier, Mihm, et al., 1984
Maier, G.; Mihm, G.; Reisenauer, H.P.; Littmann, D.,
Hetero-π-Systeme, 9. Über die Beziehungen zwischen Silaethenen und Methylsilylenen,
Chem. Ber., 1984, 117, 7, 2369, https://doi.org/10.1002/cber.19841170709
. [all data]
Raabe, Vancik, et al., 1986
Raabe, G.; Vancik, H.; West, R.; Michl, J.,
IR transition moment directions in matrix-isolated dimethylsilylene and 1-methylsilene,
J. Am. Chem. Soc., 1986, 108, 4, 671, https://doi.org/10.1021/ja00264a017
. [all data]
Reisenauer, Mihm, et al., 1982
Reisenauer, H.P.; Mihm, G.; Maier, G.,
Reversible Photoisomerisierung zwischen Silaethenen und Methylsilylenen (Methylsilandiylen),
Angew. Chem., 1982, 94, 11, 864, https://doi.org/10.1002/ange.19820941110
. [all data]
Jacox, 1994
Jacox, M.E.,
Vibrational and electronic energy levels of polyatomic transient molecules, American Chemical Society, Washington, DC, 1994, 464. [all data]