Benzene, (3-bromopropyl)-
- Formula: C9H11Br
- Molecular weight: 199.088
- IUPAC Standard InChIKey: XMZQWZJMTBCUFT-UHFFFAOYSA-N
- CAS Registry Number: 637-59-2
- Chemical structure:
View 3d structure (requires JavaScript / HTML 5) - Other names: (γ-Bromopropyl)benzene; (3-Bromopropyl)benzene; 1-Bromo-3-phenylpropane; 3-Bromo-1-phenylpropane; 3-Phenylpropyl bromide; 1-Phenyl-3-bromopropane; γ-Phenylpropyl bromide; NSC 133438

Phase change data

Data compiled by: Robert L. Brown and Stephen E. Stein
Quantity | Value | Units | Method | Reference | Comment |
---|---|---|---|---|---|
Tboil | 493. | K | N/A | Farchan Laboratories, 1990 | |
Tboil | 492.7 | K | N/A | Weast and Grasselli, 1989 |

Gas phase ion energetics data

Data compiled by: Henry M. Rosenstock, Keith Draxl, Bruce W. Steiner, and John T. Herron
Ionization energy determinations
IE (eV) | Method | Reference |
---|---|---|
9.0 ± 0.1 | EI | Grutzmacher, 1970 |
Appearance energy determinations
Ion | AE (eV) | Other Products | Method | Reference | Comment |
---|---|---|---|---|---|
C9H11+ | 10.1 | Br | EI | Grutzmacher, 1970 |

References

Farchan Laboratories, 1990
Farchan Laboratories,
Research Chemicals Catalog, Farchan Laboratories, Gainesville, FL, 1990, 91. [all data]
Weast and Grasselli, 1989
CRC Handbook of Data on Organic Compounds, 2nd Editon, Weast,R.C and Grasselli, J.G., ed(s)., CRC Press, Inc., Boca Raton, FL, 1989, 1. [all data]
Grutzmacher, 1970
Grutzmacher, H.-F.,
Zum Mechanismus massenspektrometrischer Fragmentierungsreaktionen-IV: zur Bildung von Phenonium-Ionen bei der Elektronenstoss-Fragmentierung von -Phenylathylbromiden,
Org. Mass Spectrom., 1970, 3, 131. [all data]