Ethanethioamide, N-phenyl-
- Formula: C8H9NS
- Molecular weight: 151.229
- IUPAC Standard InChIKey: MWCGLTCRJJFXKR-UHFFFAOYSA-N
- CAS Registry Number: 637-53-6
- Chemical structure:
View 3d structure (requires JavaScript / HTML 5) - Other names: Acetanilide, thio-; N-Phenylthioacetamide; Thioacetanilide; USAF ek-1902

Gas phase ion energetics data

Data compiled by: Sharon G. Lias, Rhoda D. Levin, and Sherif A. Kafafi
Ionization energy determinations
IE (eV) | Method | Reference |
---|---|---|
8.20 | EI | Baldwin, Loudon, et al., 1976 |
Appearance energy determinations
Ion | AE (eV) | Other Products | Method | Reference | Comment |
---|---|---|---|---|---|
C8H8NS+ | 9.60 | H | EI | Baldwin, Loudon, et al., 1976 |

References

Baldwin, Loudon, et al., 1976
Baldwin, M.A.; Loudon, A.G.; Maccoll, A.; Webb, K.S.,
The nature and fragmentation pathways of the molecular ions of some arylureas, arylthioureas, acetanilides, thioacetanilides and related compounds,
Org. Mass Spectrom., 1976, 11, 1181. [all data]