Benzene, 1-propenyl-
- Formula: C9H10
- Molecular weight: 118.1757
- IUPAC Standard InChIKey: QROGIFZRVHSFLM-UHFFFAOYSA-N
- CAS Registry Number: 637-50-3
- Chemical structure:
View 3d structure (requires JavaScript / HTML 5) - Stereoisomers:
- Other names: Benzene, propenyl-; β-Methylstyrene; β-Methylstyrol; ω-Methylstyrene; Isoallylbenzene; Propenylbenzene; 1-Phenyl-1-propene; 1-Phenylpropene; 1-Propene, 1-phenyl-; 1-Propenylbenzene; NSC 65591

Condensed phase thermochemistry data

Data compiled by: Hussein Y. Afeefy, Joel F. Liebman, and Stephen E. Stein
Quantity | Value | Units | Method | Reference | Comment |
---|---|---|---|---|---|
ΔcH°liquid | -4797.0 | kJ/mol | Ccb | Clopatt, 1932 | Corresponding ΔfHºliquid = -174. kJ/mol (simple calculation by NIST; no Washburn corrections) |

Phase change data

Data compiled as indicated in comments:
TRC - Thermodynamics Research Center, NIST Boulder Laboratories, Chris Muzny director
Quantity | Value | Units | Method | Reference | Comment |
---|---|---|---|---|---|
Tboil | 447. ± 3. | K | AVG | N/A | Average of 9 values; Individual data points |
Antoine Equation Parameters
log10(P) = A − (B / (T + C))
P = vapor pressure (bar)
T = temperature (K)
View plot Requires a JavaScript / HTML 5 canvas capable browser.
Temperature (K) | A | B | C | Reference | Comment |
---|---|---|---|---|---|
290.7 to 452. | 4.57451 | 1909.083 | -34.276 | Stull, 1947 | Coefficents calculated by NIST from author's data. |

Gas phase ion energetics data

Data compiled by: Sharon G. Lias, Rhoda D. Levin, and Sherif A. Kafafi
Ionization energy determinations
IE (eV) | Method | Reference |
---|---|---|
8.5 ± 0.1 | EI | Koppel, Schwarz, et al., 1974 |
Appearance energy determinations
Ion | AE (eV) | Other Products | Method | Reference | Comment |
---|---|---|---|---|---|
C9H9+ | 11.8 ± 0.1 | H | EI | Koppel, Schwarz, et al., 1974 |

Kovats' RI, non-polar column, isothermal

Column type | Active phase | Temperature (C) | I | Reference | Comment |
---|---|---|---|---|---|
Capillary | SE-30 | 130. | 1026. | Bredael, 1982 | Column length: 100. m; Column diameter: 0.5 mm |
Capillary | SE-30 | 80. | 1011. | Bredael, 1982 | Column length: 100. m; Column diameter: 0.5 mm |
Capillary | SE-30 | 65. | 1004.2 | Svob, Deur-Siftar, et al., 1974 | He; Column length: 25.5 m; Column diameter: 0.5 mm |
Capillary | SE-30 | 65. | 1004.2 | Svob, Deur-Siftar, et al., 1974 | He; Column length: 25.5 m; Column diameter: 0.5 mm |
Capillary | SE-30 | 65. | 1004.2 | Svob, Deur-Siftar, et al., 1974 | He; Column length: 25.5 m; Column diameter: 0.5 mm |
Capillary | SE-30 | 65. | 1004.2 | Svob, Deur-Siftar, et al., 1974 | He; Column length: 25.5 m; Column diameter: 0.5 mm |
Capillary | SE-30 | 65. | 1004.2 | Svob, Deur-Siftar, et al., 1974 | He; Column length: 25.5 m; Column diameter: 0.5 mm |
Capillary | SE-30 | 65. | 1004.2 | Svob and Deur-Siftar, 1974 | He; Column length: 25.5 m; Column diameter: 0.5 mm |

Kovats' RI, non-polar column, temperature ramp

Column type | Active phase | I | Reference | Comment |
---|---|---|---|---|
Capillary | DB-5 | 1000. | Buchin, Salmon, et al., 2002 | 60. m/0.32 mm/1. μm, He, 40. C @ 5. min, 3. K/min, 230. C @ 2. min |

Van Den Dool and Kratz RI, non-polar column, temperature ramp

Column type | Active phase | I | Reference | Comment |
---|---|---|---|---|
Capillary | SE-54 | 1011.2 | Shapi and Hesso, 1990 | 25. m/0.32 mm/0.15 μm, He, 40. C @ 1. min, 5. K/min, 280. C @ 15. min |
Capillary | SE-54 | 1015.9 | Shapi and Hesso, 1990 | 25. m/0.32 mm/0.15 μm, He, 40. C @ 1. min, 5. K/min, 280. C @ 15. min |

Normal alkane RI, non-polar column, temperature ramp

Column type | Active phase | I | Reference | Comment |
---|---|---|---|---|
Capillary | OV-101 | 984. | Mandelshtam, Kharicheva, et al., 1991 | Helium, 50. C @ 0. min, 3. K/min, 220. C @ 0. min; Column length: 54. m; Column diameter: 0.26 mm |

Lee's RI, non-polar column, custom temperature program

Column type | Active phase | I | Reference | Comment |
---|---|---|---|---|
Capillary | DB-5MS | 166.5 | Aracil, Font, et al., 2005 | Column length: 60. m; Column diameter: 0.25 mm; Program: not specified |
Capillary | HP-5MS | 165.63 | Cheng, Liu, et al., 2005 | 30. m/0.30 mm/0.25 μm, He; Program: 50 0C (2 min) 8 0C/min -> 120 0C (3 min) 10 0C/min -> 230 0C |

References

Clopatt, 1932
Clopatt, J.A.,
Eine neue Methode zur Bestimmung der Verbrennungswarme fluchtiger Stoffe,
Soc. Scient. Fenn. Commentat. Phys. Math., 1932, 6, 1-15. [all data]
Stull, 1947
Stull, Daniel R.,
Vapor Pressure of Pure Substances. Organic and Inorganic Compounds,
Ind. Eng. Chem., 1947, 39, 4, 517-540, https://doi.org/10.1021/ie50448a022
. [all data]
Koppel, Schwarz, et al., 1974
Koppel, C.; Schwarz, H.; Bohlmann, F.,
Elektronenstossinduzierte fragmentierung von acetylenverbindungen. VIII. Struktur der stabilen und instabilen ionen[C9H9]+ aus isomeren C9H10- kohlenwasserstoffen,
Org. Mass Spectrom., 1974, 8, 25. [all data]
Shabarov, et al., 1962
Shabarov, Y.S., et al.,
Zhur. Obshchei Khim. (in Rus.), 1962, 32, 3184. [all data]
Bredael, 1982
Bredael, P.,
Retention indices of hydrocarbons on SE-30,
J. Hi. Res. Chromatogr. Chromatogr. Comm., 1982, 5, 6, 325-328, https://doi.org/10.1002/jhrc.1240050610
. [all data]
Svob, Deur-Siftar, et al., 1974
Svob, V.; Deur-Siftar, D.; Cramers, C.A.,
Mechanisms of the thermal degradation of alkylbenzenes,
J. Chromatogr., 1974, 91, 659-675, https://doi.org/10.1016/S0021-9673(01)97946-4
. [all data]
Svob and Deur-Siftar, 1974
Svob, V.; Deur-Siftar, D.,
Kovats Retention Indices in the Identification of Alkylbenzene Degradation Products,
J. Chromatogr., 1974, 91, 677-689, https://doi.org/10.1016/S0021-9673(01)97947-6
. [all data]
Buchin, Salmon, et al., 2002
Buchin, S.; Salmon, J.-C.; Carnat, A.-P.; Berger, T.; Bugaud, C.; Bosset, J.O.,
Identification de composés monoterpéniques, sesquiterpéniques et benzéniques dans un lait d'alpage très riche en ces substances,
Mitt. Lebensmittelunters. Hyg., 2002, 93, 199-216. [all data]
Shapi and Hesso, 1990
Shapi, M.M.; Hesso, A.,
Thermal decomposition of polystyrene volatile compounds from large-scale pyrolysis,
J. Anal. Appl. Pyrolysis, 1990, 18, 2, 143-161, https://doi.org/10.1016/0165-2370(90)80004-8
. [all data]
Mandelshtam, Kharicheva, et al., 1991
Mandelshtam, T.V.; Kharicheva, E.M.; Gorobets, I.A.; Zenkevich, I.G.; Kostikov, R.R.; Porokhovnikova, E.B.,
Synthesis and Chromato Mass Spectrometric Investigation of alpha-Alkoxystyrenes,
Zh. Org. Khim. (Rus.), 1991, 27, 4, 684-690. [all data]
Aracil, Font, et al., 2005
Aracil, I.; Font, R.; Conesa, J.A.,
Semivolatile and volatile compounds from the pyrolysis and combustion of polyvinyl chloride,
J. Anal. Appl. Pyrolysis, 2005, 74, 1-2, 465-478, https://doi.org/10.1016/j.jaap.2004.09.008
. [all data]
Cheng, Liu, et al., 2005
Cheng, D.-X.; Liu, B.-X.; Sun, Y.-A.; Xie, B.; Zhang, H.-L.,
rapid analysis of pyrolysis products of cholesterol by GC-MS assited with boiling point - Lee retention index,
journal of Instrumental Analysis - Fenxi ceshi xuebao, 2005, 24, 6, 85-88. [all data]