4-Benzyloxyaniline
- Formula: C13H13NO
- Molecular weight: 199.2484
- IUPAC Standard InChIKey: FIIDVVUUWRJXLF-UHFFFAOYSA-N
- CAS Registry Number: 6373-46-2
- Chemical structure:
View 3d structure (requires JavaScript / HTML 5) - Other names: p-Benzyloxyaniline; Benzenamine, 4-(phenylmethoxy)-; Aniline, p-(benzyloxy)-; 4-Aminophenyl benzyl ether

Gas phase ion energetics data

Data compiled as indicated in comments:
LLK - Sharon G. Lias, Rhoda D. Levin, and Sherif A. Kafafi
RDSH - Henry M. Rosenstock, Keith Draxl, Bruce W. Steiner, and John T. Herron
Ionization energy determinations
IE (eV) | Method | Reference | Comment |
---|---|---|---|
7.58 | CTS | Weschke, Timpe, et al., 1979 | LLK |
7.6 | EI | Ward, Cooks, et al., 1969 | RDSH |
Appearance energy determinations
Ion | AE (eV) | Other Products | Method | Reference | Comment |
---|---|---|---|---|---|
C6H6NO+ | 9.7 | ? | EI | Ward, Cooks, et al., 1969 | RDSH |
C7H7+ | 9.9 | ? | EI | Ward, Cooks, et al., 1969 | RDSH |

References

Weschke, Timpe, et al., 1979
Weschke, W.; Timpe, H.-J.; Just, G.,
Untersuchungen an EDA-Komplexen von Benzylarylethern,
J. Prakt. Chem., 1979, 321, 605. [all data]
Ward, Cooks, et al., 1969
Ward, R.S.; Cooks, R.d.; Williams, D.H.,
Substituent effects in mass spectrometry. Mass spectra of substituted phenyl benzyl ethers,
J. Am. Chem. Soc., 1969, 91, 2727. [all data]