Benzene, 1-iodo-4-nitro-
- Formula: C6H4INO2
- Molecular weight: 249.0059
- IUPAC Standard InChIKey: SCCCFNJTCDSLCY-UHFFFAOYSA-N
- CAS Registry Number: 636-98-6
- Chemical structure:
View 3d structure (requires JavaScript / HTML 5) - Other names: p-Iodonitrobenzene; p-Nitroiodobenzene; p-Nitrophenyl iodide; 1-Iodo-4-nitrobenzene; 4-Iodonitrobenzene; 4-Nitroiodobenzene

Phase change data

Data compiled as indicated in comments:
BS - Robert L. Brown and Stephen E. Stein
TRC - Thermodynamics Research Center, NIST Boulder Laboratories, Chris Muzny director
Quantity | Value | Units | Method | Reference | Comment |
---|---|---|---|---|---|
Tfus | 446. | K | N/A | Timmermans, 1935 | Uncertainty assigned by TRC = 2. K; TRC |
Reduced pressure boiling point
Tboil (K) | Pressure (bar) | Reference | Comment |
---|---|---|---|
562.2 | 1.03 | Weast and Grasselli, 1989 | BS |

Gas phase ion energetics data

Data compiled by: Sharon G. Lias, Rhoda D. Levin, and Sherif A. Kafafi
Ionization energy determinations
IE (eV) | Method | Reference |
---|---|---|
9.24 | PE | Behan, Johnstone, et al., 1976 |

References

Timmermans, 1935
Timmermans, J.,
Researches in Stoichiometry. I. The Heat of Fusion of Organic Compounds.,
Bull. Soc. Chim. Belg., 1935, 44, 17-40. [all data]
Weast and Grasselli, 1989
CRC Handbook of Data on Organic Compounds, 2nd Editon, Weast,R.C and Grasselli, J.G., ed(s)., CRC Press, Inc., Boca Raton, FL, 1989, 1. [all data]
Behan, Johnstone, et al., 1976
Behan, J.M.; Johnstone, R.A.W.; Bentley, T.W.,
An evaluation of empirical methods for calculating the ionization potentials of substituted benzenes,
Org. Mass Spectrom., 1976, 11, 207. [all data]