L-Methionine
- Formula: C5H11NO2S
- Molecular weight: 149.211
- IUPAC Standard InChIKey: FFEARJCKVFRZRR-SCSAIBSYSA-N
- CAS Registry Number: 63-68-3
- Chemical structure:
- Other names: Methionine; Methionine, L-; γ-Methylthio-α-aminobutyric acid; Butanoic acid, 2-amino-4-(methylthio)-, (S)-; Cymethion; L-(-)-Methionine; Met; S-Methionine; 2-Amino-4-(methylthio)butyric acid; Butyric acid, 2-amino-4-(methylthio)-; L(-)-Amino-γ-methylthiobutyric acid; L-α-Amino-γ-methylmercaptobutyric acid; L-γ-Methylthio-α-aminobutyric acid; 2-Amino-4-methylthiobutanoic acid; Liquimeth; Acimethin; L-2-Amino-4-(methylthio)butyric acid; (S)-2-Amino-4-(methylthio)butanoic acid; h-Met-oh; L-Homocysteine, S-methyl-; NSC 22946; 2-Amino-4-methylthiobutanoic acid (S)-

Condensed phase thermochemistry data

Data compiled by: Hussein Y. Afeefy, Joel F. Liebman, and Stephen E. Stein
Quantity | Value | Units | Method | Reference | Comment |
---|---|---|---|---|---|
ΔfH°solid | -577.5 ± 0.7 | kJ/mol | Ccr | Sabbah and Minadakis, 1981 | |
Quantity | Value | Units | Method | Reference | Comment |
ΔcH°solid | -3564.11 ± 0.61 | kJ/mol | Ccr | Sabbah and Minadakis, 1981 | |
ΔcH°solid | -3176. ± 0.8 | kJ/mol | Ccb | Tsuzuki, Harper, et al., 1958 |

Phase change data

Data compiled as indicated in comments:
ALS - Hussein Y. Afeefy, Joel F. Liebman, and Stephen E. Stein
AC - William E. Acree, Jr., James S. Chickos
Quantity | Value | Units | Method | Reference | Comment |
---|---|---|---|---|---|
ΔsubH° | 164. ± 4. | kJ/mol | C | Sabbah and Minadakis, 1981 | ALS |
ΔsubH° | 164. ± 4. | kJ/mol | C | Sabbah and Minadakis, 1981 | AC |
Enthalpy of sublimation
ΔsubH (kJ/mol) | Temperature (K) | Method | Reference | Comment |
---|---|---|---|---|
125. | 474. | A | Stephenson and Malanowski, 1987 | Based on data from 463. to 485. K.; AC |
125. ± 0.8 | 455. | V | Svec and Clyde, 1965 | ALS |

Gas phase ion energetics data

Data evaluated as indicated in comments:
HL - Edward P. Hunter and Sharon G. Lias
Data compiled as indicated in comments:
LBLHLM - Sharon G. Lias, John E. Bartmess, Joel F. Liebman, John L. Holmes, Rhoda D. Levin, and W. Gary Mallard
RDSH - Henry M. Rosenstock, Keith Draxl, Bruce W. Steiner, and John T. Herron
Quantity | Value | Units | Method | Reference | Comment |
---|---|---|---|---|---|
Proton affinity (review) | 935.4 | kJ/mol | N/A | Hunter and Lias, 1998 | HL |
Quantity | Value | Units | Method | Reference | Comment |
Gas basicity | 901.5 | kJ/mol | N/A | Hunter and Lias, 1998 | HL |
Ionization energy determinations
IE (eV) | Method | Reference | Comment |
---|---|---|---|
8.3 | PE | Cannington and Ham, 1983 | LBLHLM |
8.63 ± 0.10 | EI | Svec and Junk, 1967 | RDSH |
~9. | PI | Akopyan and Loginov, 1967 | RDSH |
8.65 | PE | Cannington and Ham, 1983 | Vertical value; LBLHLM |
Appearance energy determinations
Ion | AE (eV) | Other Products | Method | Reference | Comment |
---|---|---|---|---|---|
CH3S+ | 13.0 ± 0.2 | ? | EI | Svec and Junk, 1967 | RDSH |
C2H5S+ | 12.43 ± 0.10 | ? | EI | Svec and Junk, 1967 | RDSH |
C4H10NS+ | 9.68 ± 0.15 | ? | EI | Svec and Junk, 1967 | RDSH |

Gas phase thermochemistry data

Data compiled by: Hussein Y. Afeefy, Joel F. Liebman, and Stephen E. Stein
Quantity | Value | Units | Method | Reference | Comment |
---|---|---|---|---|---|
ΔfH°gas | -98.83 ± 0.98 | kcal/mol | Ccr | Sabbah and Minadakis, 1981 |

References

Sabbah and Minadakis, 1981
Sabbah, R.; Minadakis, C.,
Thermodynamique de substances soufrees. II. Etude thermochimique de la l-cysteine et de la l-methionine,
Thermochim. Acta, 1981, 43, 269-277. [all data]
Tsuzuki, Harper, et al., 1958
Tsuzuki, T.; Harper, D.O.; Hunt, H.,
Heats of combustion. VII. The heats of combustion of some amino acids,
J. Phys. Chem., 1958, 62, 1594-1595. [all data]
Stephenson and Malanowski, 1987
Stephenson, Richard M.; Malanowski, Stanislaw,
Handbook of the Thermodynamics of Organic Compounds, 1987, https://doi.org/10.1007/978-94-009-3173-2
. [all data]
Svec and Clyde, 1965
Svec, H.J.; Clyde, D.D.,
Vapor pressures of some α-amino acids,
J. Chem. Eng. Data, 1965, 10, 151. [all data]
Hunter and Lias, 1998
Hunter, E.P.; Lias, S.G.,
Evaluated Gas Phase Basicities and Proton Affinities of Molecules: An Update,
J. Phys. Chem. Ref. Data, 1998, 27, 3, 413-656, https://doi.org/10.1063/1.556018
. [all data]
Cannington and Ham, 1983
Cannington, P.H.; Ham, N.S.,
He(I) and He(II) photoelectron spectra of glycine and related molecules,
J. Electron Spectrosc. Relat. Phenom., 1983, 32, 139. [all data]
Svec and Junk, 1967
Svec, H.J.; Junk, G.A.,
Electron-impact studies of substituted alkanes,
J. Am. Chem. Soc., 1967, 89, 790. [all data]
Akopyan and Loginov, 1967
Akopyan, M.E.; Loginov, Yy.V.,
Mass-spectrometric study of the phoionization of free α-aminoacids,
High Energy Chem., 1967, 1, 83, In original 97. [all data]