1H-Pyrrole, 2-methyl-
- Formula: C5H7N
- Molecular weight: 81.1158
- IUPAC Standard InChIKey: TVCXVUHHCUYLGX-UHFFFAOYSA-N
- CAS Registry Number: 636-41-9
- Chemical structure:
View 3d structure (requires JavaScript / HTML 5) - Other names: Pyrrole, 2-methyl-; α-Methylpyrrole; 2-Methylpyrrole; 2-methyl-1H-pyrrole

Phase change data

Data compiled by: Thermodynamics Research Center, NIST Boulder Laboratories, Chris Muzny director
Quantity | Value | Units | Method | Reference | Comment |
---|---|---|---|---|---|
Tboil | 421. | K | N/A | Cumper and Wood, 1971 | Uncertainty assigned by TRC = 2. K |
Tboil | 421.15 | K | N/A | Rapoport and Baldridge, 1952 | Uncertainty assigned by TRC = 2. K |
Tboil | 420.65 | K | N/A | Lecat, 1947 | Uncertainty assigned by TRC = 0.5 K |
Tboil | 421.15 | K | N/A | Fischer, Beller, et al., 1928 | Uncertainty assigned by TRC = 2. K; named ".alpha.-methyl-pyrrol" |
Quantity | Value | Units | Method | Reference | Comment |
Tfus | 237.55 | K | N/A | Lanum and Morris, 1969 | Uncertainty assigned by TRC = 0.3 K |
Tfus | 237.55 | K | N/A | Anonymous, 1957 | Uncertainty assigned by TRC = 0.4 K |

Gas phase ion energetics data

Data compiled as indicated in comments:
LLK - Sharon G. Lias, Rhoda D. Levin, and Sherif A. Kafafi
RDSH - Henry M. Rosenstock, Keith Draxl, Bruce W. Steiner, and John T. Herron
Ionization energy determinations
IE (eV) | Method | Reference | Comment |
---|---|---|---|
8.01 ± 0.05 | EI | Linda, Marino, et al., 1971 | LLK |
7.78 ± 0.01 | PI | Potapov and Yuzhakova, 1970 | RDSH |
Appearance energy determinations
Ion | AE (eV) | Other Products | Method | Reference | Comment |
---|---|---|---|---|---|
C5H6N+ | 10.3 ± 0.1 | H | PI | Potapov and Yuzhakova, 1970 | RDSH |

Normal alkane RI, non-polar column, temperature ramp

Data compiled by: NIST Mass Spectrometry Data Center, William E. Wallace, director

Column type CapillaryCapillaryCapillary
Active phase MDN-5MDN-5SPB-5
Column length (m) 60.60.60.
Carrier gas HeHeHelium
Substrate
Column diameter (mm) 0.250.250.32
Phase thickness (μm) 0.250.251.0
Tstart (C) 40.40.30.
Tend (C) 270.270.230.
Heat rate (K/min) 4.4.3.
Initial hold (min) 4.4.
Final hold (min) 5.5.
I 843.845.839.
Referencevan Loon, Linssen, et al., 2005van Loon, Linssen, et al., 2005Sebastian, Viallon-Fernandez, et al., 2003
Comment MSDC-RI MSDC-RI MSDC-RI

Van Den Dool and Kratz RI, non-polar column, custom temperature program

Data compiled by: NIST Mass Spectrometry Data Center, William E. Wallace, director

Column type CapillaryCapillaryCapillary
Active phase CP Sil 8 CBDB-5BPX-5
Column length (m) 60.50.50.
Carrier gas HeHeHe
Substrate
Column diameter (mm) 0.250.320.32
Phase thickness (μm) 0.250.50.5
Program 0C => rapidly => 40C(8min) => 4C/min => 250C(10min)oC(5min) => 60C/min => 60C (5min) => 4C/min => 250COC (5min) => 60C/min => 60C(5min) => 4C/min => 250C
I 847.856.855.
ReferenceOruna-Concha, Bakker, et al., 2002Parker, Hassell, et al., 2000Bredie, Mottram, et al., 1998
Comment MSDC-RI MSDC-RI MSDC-RI

Normal alkane RI, non-polar column, custom temperature program

Data compiled by: NIST Mass Spectrometry Data Center, William E. Wallace, director

Column type CapillaryCapillaryCapillary
Active phase Methyl SiliconeDB-1DB-1
Column length (m)  60.60.
Carrier gas
Substrate
Column diameter (mm)  0.250.25
Phase thickness (μm)  0.250.25
Program not specifiednot specifiednot specified
I 837.812.812.
ReferenceZenkevich, 1999Kawai, Ishida, et al., 1991Kawai, Ishida, et al., 1991
Comment MSDC-RI MSDC-RI MSDC-RI

References

Cumper and Wood, 1971
Cumper, C.W.N.; Wood, J.W.M.,
Dielectric relaxation and dipole moments of substituted pyrroles.,
J. Chem. Soc. B, 1971, 1811. [all data]
Rapoport and Baldridge, 1952
Rapoport, H.; Baldridge, H.D.,
The Nitrogen-Containing Ring of Carpaine,
J. Am. Chem. Soc., 1952, 74, 5365. [all data]
Lecat, 1947
Lecat, M.,
Some azeotropes of which one constituant is heterocyclic nitrogen,
Ann. Soc. Sci. Bruxelles, Ser. 1, 1947, 61, 73. [all data]
Fischer, Beller, et al., 1928
Fischer, H.; Beller, H.; Stern, A.,
Some transformations of 2-methyl-3-carbethoxypyrrole, 2-methylpyrrole and 2,3-dimethylpyrrole,
Ber. Dtsch. Chem. Ges. B, 1928, 61, 1074. [all data]
Lanum and Morris, 1969
Lanum, W.J.; Morris, J.C.,
Physical Properties of Some Sulfur and Nitrogen Compounds,
J. Chem. Eng. Data, 1969, 14, 93-8. [all data]
Anonymous, 1957
Anonymous, R.,
, Am. Pet. Inst. Res. Proj. 6, Carnegie-Mellon Univ., 1957. [all data]
Linda, Marino, et al., 1971
Linda, P.; Marino, G.; Pignataro, S.,
A comparison of sensitivities to substituent effects of five- membered heteroaromatic rings in gas phase ionization,
J. Chem. Soc. B, 1971, 1585. [all data]
Potapov and Yuzhakova, 1970
Potapov, V.K.; Yuzhakova, O.A.,
Photoionization and electronic structure of pyrrole and its methyl derivatives,
Dokl. Akad. Nauk SSSR, 1970, 192, 131, In original 365. [all data]