1,4-Anthracenedione
- Formula: C14H8O2
- Molecular weight: 208.2121
- IUPAC Standard InChIKey: LSOTZYUVGZKSHR-UHFFFAOYSA-N
- CAS Registry Number: 635-12-1
- Chemical structure:
View 3d structure (requires JavaScript / HTML 5) - Other names: 1,4-Anthraquinone; 1,4-Anthracenequinone

Gas phase ion energetics data

Data compiled by: Sharon G. Lias, Rhoda D. Levin, and Sherif A. Kafafi
Ionization energy determinations
IE (eV) | Method | Reference |
---|---|---|
8.45 ± 0.02 | PI | Potapov and Sorokin, 1971 |

Lee's RI, non-polar column, custom temperature program

Column type | Active phase | I | Reference | Comment |
---|---|---|---|---|
Capillary | DB-5 | 328.5 | Helmig and Harger, 1994 | He; Column length: 60. m; Column diameter: 0.248 mm; Program: 50C (2min) => 25C/min => 150C => 4C/min => 325C |

References

Potapov and Sorokin, 1971
Potapov, V.K.; Sorokin, V.V.,
Photoionization and ion-molecule reactions in quinones and alcohols,
High Energy Chem., 1971, 5, 435, In original 487. [all data]
Hartmann and Lorenz, 1952
Hartmann, H.; Lorenz, E.,
Z. Naturforsh, 1952, 7a, 360. [all data]
Helmig and Harger, 1994
Helmig, D.; Harger, W.P.,
OH radical-initiated gas-phase reaction products of phenanthrene,
Sci. Total Environ., 1994, 148, 1, 11-21, https://doi.org/10.1016/0048-9697(94)90368-9
. [all data]