1,4-Diazepine-2,3-dithione, 1,4-dimethyl-perhydro-
- Formula: C7H12N2S2
- Molecular weight: 188.314
- IUPAC Standard InChIKey: GQXMHPUJSWSLQY-UHFFFAOYSA-N
- CAS Registry Number: 63434-97-9
- Chemical structure:
View 3d structure (requires JavaScript / HTML 5) - Permanent link for this species. Use this link for bookmarking this species for future reference.

Gas phase ion energetics data

Data compiled by: Sharon G. Lias, Rhoda D. Levin, and Sherif A. Kafafi
Ionization energy determinations
IE (eV) | Method | Reference | Comment |
---|---|---|---|
7.83 | PE | Henriksen, Isaksson, et al., 1981 | Vertical value |

References

Henriksen, Isaksson, et al., 1981
Henriksen, L.; Isaksson, R.; Liljefors, T.; Sandstrom, J.,
Ultraviolet absorption and photoelectron spectra of some cyclic and open-chain mono- and dithiooxamides,
Acta Chem. Scand., Ser. B, 1981, 35, 489. [all data]