Phenol, 2,4-dichloro-, acetate
- Formula: C8H6Cl2O2
- Molecular weight: 205.038
- IUPAC Standard InChIKey: KGXUYVOKSRCTEK-UHFFFAOYSA-N
- CAS Registry Number: 6341-97-5
- Chemical structure:

Phase change data

Data compiled by: Robert L. Brown and Stephen E. Stein
Quantity | Value | Units | Method | Reference | Comment |
---|---|---|---|---|---|
Tboil | 517.7 | K | N/A | Weast and Grasselli, 1989 |

Gas phase ion energetics data

Data compiled by: Sharon G. Lias, Rhoda D. Levin, and Sherif A. Kafafi
Ionization energy determinations
IE (eV) | Method | Reference |
---|---|---|
8.16 ± 0.03 | EI | Benezra and Bursey, 1972 |
Appearance energy determinations
Ion | AE (eV) | Other Products | Method | Reference | Comment |
---|---|---|---|---|---|
C2H3O+ | 12.11 ± 0.03 | ? | EI | Benezra and Bursey, 1972 | |
C6H4OCl2+ | 9.37 ± 0.03 | CH2=C=O | EI | Benezra and Bursey, 1972 |

Kovats' RI, non-polar column, isothermal

View large format table.

Column type Active phase Temperature (C) I Reference Comment
CapillarySE-30160.1317.Evans and Haken, 1989Column length: 25. m; Column diameter: 0.32 mm
CapillarySE-30180.1351.Tarjan, Nyiredy, et al., 1989
CapillaryOV-101160.1317.Haken and Korhonen, 1983N2; Column length: 25. m; Column diameter: 0.22 mm
CapillaryOV-101180.1351.Haken and Korhonen, 1983N2; Column length: 25. m; Column diameter: 0.22 mm

Kovats' RI, polar column, isothermal

View large format table.

Column type Active phase Temperature (C) I Reference Comment
CapillaryOV-351160.1986.Evans and Haken, 1989Column length: 25. m; Column diameter: 0.32 mm

Van Den Dool and Kratz RI, non-polar column, temperature ramp

View large format table.

Column type Active phase I Reference Comment
CapillaryZB-11325.Urbanczyk, Staniewski, et al., 200230. m/0.25 mm/0.50 μm, He, 50. C @ 3. min, 10. K/min, 280. C @ 10. min

References

Weast and Grasselli, 1989
CRC Handbook of Data on Organic Compounds, 2nd Editon, Weast,R.C and Grasselli, J.G., ed(s)., CRC Press, Inc., Boca Raton, FL, 1989, 1. [all data]
Benezra and Bursey, 1972
Benezra, S.A.; Bursey, M.M.,
ortho-Effects in mass spectra. Alteration of the molecular-ion energy distribution in disubstituted acetanilides,
Z. Naturforsch. A:, 1972, 27, 670. [all data]