Phenol, 4-(2-phenylethyl)-
- Formula: C14H14O
- Molecular weight: 198.2604
- IUPAC Standard InChIKey: YTLSTADDHMJUMW-UHFFFAOYSA-N
- CAS Registry Number: 6335-83-7
- Chemical structure:
View 3d structure (requires JavaScript / HTML 5) - Other names: Phenol, p-phenethyl-; 4-Phenethylphenol; 1-(4-Hydroxyphenyl)-2-phenylethane

Gas phase ion energetics data

Data compiled by: Henry M. Rosenstock, Keith Draxl, Bruce W. Steiner, and John T. Herron
Ionization energy determinations
IE (eV) | Method | Reference |
---|---|---|
8.3 ± 0.1 | EI | McLafferty, Wachs, et al., 1970 |
Appearance energy determinations
Ion | AE (eV) | Other Products | Method | Reference | Comment |
---|---|---|---|---|---|
C7H7+ | ~15. | ? | EI | McLafferty, Wachs, et al., 1970 | |
C7H7O+ | 9.8 ± 0.2 | C7H7 | EI | McLafferty, Wachs, et al., 1970 |

References

McLafferty, Wachs, et al., 1970
McLafferty, F.W.; Wachs, T.; Lifshitz, C.; Innorta, G.; Irving, P.,
Substituent effects in unimolecular ion decompositions. XV. Mechanistic interpretations and the quasi-equilibrium theory,
J. Am. Chem. Soc., 1970, 92, 6867. [all data]