Benzene,1-(1-ethylcyclopropyl)-4-methoxy-

Gas phase ion energetics data

Data compiled by: Sharon G. Lias, Rhoda D. Levin, and Sherif A. Kafafi

Ionization energy determinations

IE (eV) Method Reference Comment
8.11PEPrins, Verhoeven, et al., 1977Vertical value

References

Prins, Verhoeven, et al., 1977
Prins, I.; Verhoeven, J.W.; DeBoer, Th.J.; Worrell, C., Conformational studies on arylcyclopropanes-I, Tetrahedron, 1977, 33, 127. [all data]