2(1H)-Pyrimidinone,5-fluoro-1-methyl-
- Formula: C5H5FN2O
- Molecular weight: 128.1044
- IUPAC Standard InChIKey: YHPKZDOJZWPLRR-UHFFFAOYSA-N
- CAS Registry Number: 63331-05-5
- Chemical structure:
View 3d structure (requires JavaScript / HTML 5) - Permanent link for this species. Use this link for bookmarking this species for future reference.

Gas phase ion energetics data

Data compiled by: Sharon G. Lias, Rhoda D. Levin, and Sherif A. Kafafi
Ionization energy determinations
IE (eV) | Method | Reference |
---|---|---|
9.21 ± 0.05 | EI | Gacek, Thorstad, et al., 1978 |

References

Gacek, Thorstad, et al., 1978
Gacek, M.; Thorstad, O.; Ongstad, L.; Undheim, K.,
Ionisation potentials in tautomer analysis of 2-hydroxypyrimidines,
Chem. Scr., 1978, 13, 99. [all data]