2-Acetyl-3,4-dimethylphosphole manganese tricarbonyl

Gas phase ion energetics data

Data compiled by: Sharon G. Lias, Rhoda D. Levin, and Sherif A. Kafafi

Ionization energy determinations

IE (eV) Method Reference Comment
8.2PEGuimon, Pfister-Guillouzo, et al., 1979Vertical value

References

Guimon, Pfister-Guillouzo, et al., 1979
Guimon, C.; Pfister-Guillouzo, G.; Mathey, F., Electronic structure of phosphacymantrene by photoelectron spectroscopy (He I, He II) and E.H.T. calculations, Nouv. J. Chim., 1979, 3, 725. [all data]