1,4-Cyclohexadiene,1,4-dimethyl-3,6-bis(methylene)-

Gas phase ion energetics data

Data compiled as indicated in comments:
LBLHLM - Sharon G. Lias, John E. Bartmess, Joel F. Liebman, John L. Holmes, Rhoda D. Levin, and W. Gary Mallard
LLK - Sharon G. Lias, Rhoda D. Levin, and Sherif A. Kafafi

Ionization energy determinations

IE (eV) Method Reference Comment
7.58PEDewar, 1982Vertical value; LBLHLM
7.58PEKoenig and Southworth, 1977Vertical value; LLK

References

Dewar, 1982
Dewar, M.J.S., Ionization energies of p-quinodimethane and 2,5-dimethyl-p-quinodimethane, J. Am. Chem. Soc., 1982, 104, 1447. [all data]

Koenig and Southworth, 1977
Koenig, T.; Southworth, S., The He I photoelectron spectrum of 3,7-dimethyl-p-quinodimethane. A non-Koopmans theorem effect, J. Am. Chem. Soc., 1977, 99, 2807. [all data]