4-Chloro-2-butanone
- Formula: C4H7ClO
- Molecular weight: 106.551
- IUPAC Standard InChIKey: MAGOYBJJLVSJIC-UHFFFAOYSA-N
- CAS Registry Number: 6322-49-2
- Chemical structure:
View 3d structure (requires JavaScript / HTML 5) - Other names: 2-Butanone, 4-chloro-; 1-Chloro-3-butanone; 4-chlorobutan-2-one

Phase change data

Data compiled by: Robert L. Brown and Stephen E. Stein
Reduced pressure boiling point
Tboil (K) | Pressure (bar) | Reference |
---|---|---|
324. to 328. | 0.027 | Frinton Laboratories Inc., 1986 |

Gas phase ion energetics data

Data compiled by: Sharon G. Lias and Joel F. Liebman
Appearance energy determinations
Ion | AE (eV) | Other Products | Method | Reference | Comment |
---|---|---|---|---|---|
C2H3O+ | 10.42 | ClCH2CH2 | EI | Holmes and Lossing, 1988 |

Normal alkane RI, non-polar column, temperature ramp

Column type | Active phase | I | Reference | Comment |
---|---|---|---|---|
Capillary | OV-101 | 760. | Zenkevich, 2005 | 25. m/0.20 mm/0.10 μm, N2/He, 6. K/min; Tstart: 50. C; Tend: 250. C |

References

Frinton Laboratories Inc., 1986
Frinton Laboratories Inc.,
Catalog Number 11, Frinton Laboratories Inc., Vineland, NJ, 1986, 99. [all data]
Holmes and Lossing, 1988
Holmes, J.L.; Lossing, F.P.,
Heats of formation and bond dissociation energies in halogen-substituted methyl and ethyl radicals,
J. Am. Chem. Soc., 1988, 110, 7343. [all data]
Zenkevich, 2005
Zenkevich, I.G.,
Experimentally measured retention indices., 2005. [all data]