Thiophene, 3,4-dimethyl-
- Formula: C6H8S
- Molecular weight: 112.193
- IUPAC Standard InChIKey: GPSFYJDZKSRMKZ-UHFFFAOYSA-N
- CAS Registry Number: 632-15-5
- Chemical structure:
View 3d structure (requires JavaScript / HTML 5) - Other names: 3,4-Dimethylthiophene

Phase change data

Data compiled as indicated in comments:
BS - Robert L. Brown and Stephen E. Stein
AC - William E. Acree, Jr., James S. Chickos
Quantity | Value | Units | Method | Reference | Comment |
---|---|---|---|---|---|
Tboil | 418.2 | K | N/A | Weast and Grasselli, 1989 | BS |
Enthalpy of vaporization
ΔvapH (kJ/mol) | Temperature (K) | Method | Reference | Comment |
---|---|---|---|---|
41.1 | 343. | A | Stephenson and Malanowski, 1987 | Based on data from 328. to 478. K. See also Dykyj, 1972 and Dykyj, Svoboda, et al., 1999.; AC |

Gas phase ion energetics data

Data compiled as indicated in comments:
LBLHLM - Sharon G. Lias, John E. Bartmess, Joel F. Liebman, John L. Holmes, Rhoda D. Levin, and W. Gary Mallard
Ionization energy determinations
IE (eV) | Method | Reference | Comment |
---|---|---|---|
8.55 | PE | Bock and Roth, 1983 | Vertical value; LBLHLM |

Van Den Dool and Kratz RI, polar column, temperature ramp

Data compiled by: NIST Mass Spectrometry Data Center, William E. Wallace, director

Column type CapillaryCapillaryCapillaryCapillaryCapillary
Active phase DB-WaxDB-WaxDB-WaxDB-WaxDB-Wax
Column length (m) 30.30.30.30.30.
Carrier gas HeHeHeHeHe
Substrate
Column diameter (mm) 0.250.250.250.250.25
Phase thickness (μm) 0.250.250.250.250.25
Tstart (C) 40.45.45.45.45.
Tend (C) 250.240.240.240.240.
Heat rate (K/min) 3.6.6.6.3.
Initial hold (min) 5.10.10.10.10.
Final hold (min) 10.30.30.30.30.
I 1250.1253.1253.1253.1240.
ReferenceAromdee and Sriubolmas, 2006Nielsen, Larsen, et al., 2004Nielsen, Larsen, et al., 2004, 2Nielsen, Larsen, et al., 2004, 2Nielsen and Poll, 2004
Comment MSDC-RI MSDC-RI MSDC-RI MSDC-RI MSDC-RI

Normal alkane RI, non-polar column, custom temperature program

Data compiled by: NIST Mass Spectrometry Data Center, William E. Wallace, director

Column type CapillaryCapillaryCapillaryCapillaryCapillary
Active phase VF-5VF-5HP-5 MSHP-5PONA
Column length (m) 30.30.30.60.50.
Carrier gas HeliumHeliumHeliumHelium
Substrate
Column diameter (mm) 0.250.250.250.250.20
Phase thickness (μm) 0.250.250.250.250.50
Program 50 0C (2 min) 3 0C/min -> 200 0C (3 min) 10 0C/min -> 220 0C (8 min)not specified40 0C (5 min) 30 0C/min -> 60 0C 6 0C/min -> 230 0C (10 min)30 0C (2 min) 2 0Cmin -> 60 0C 10 0C/min -> 100 0C 20 0C/min -> 140 0C 10 0C/min -> 200 0C (10 min)not specified
I 889.888.881.881.885.
ReferenceShivashankar, Roy, et al., 2012Shivashankar, Roy, et al., 2012Grzeszczuk, Wesolowska, et al., 2011Rotsatschakul, Visesanguan, et al., 2009Yang, Wang, et al., 2003
Comment MSDC-RI MSDC-RI MSDC-RI MSDC-RI MSDC-RI

References

Weast and Grasselli, 1989
CRC Handbook of Data on Organic Compounds, 2nd Editon, Weast,R.C and Grasselli, J.G., ed(s)., CRC Press, Inc., Boca Raton, FL, 1989, 1. [all data]
Stephenson and Malanowski, 1987
Stephenson, Richard M.; Malanowski, Stanislaw,
Handbook of the Thermodynamics of Organic Compounds, 1987, https://doi.org/10.1007/978-94-009-3173-2
. [all data]
Dykyj, 1972
Dykyj, J.,
Petrochemia, 1972, 12, 1, 13. [all data]
Dykyj, Svoboda, et al., 1999
Dykyj, J.; Svoboda, J.; Wilhoit, R.C.; Frenkel, M.L.; Hall, K.R.,
Vapor Pressure of Chemicals: Part A. Vapor Pressure and Antoine Constants for Hydrocarbons and Sulfur, Selenium, Tellurium and Hydrogen Containing Organic Compounds, Springer, Berlin, 1999, 373. [all data]
Bock and Roth, 1983
Bock, H.; Roth, B.,
Radical ions. 49. Redox reactions of some thiophene derivatives,
Phosphorus Sulfur, 1983, 14, 211. [all data]