Urea, trimethyl-
- Formula: C4H10N2O
- Molecular weight: 102.1350
- IUPAC Standard InChIKey: COSWCAGTKRUTQV-UHFFFAOYSA-N
- CAS Registry Number: 632-14-4
- Chemical structure:
View 3d structure (requires JavaScript / HTML 5) - Other names: N,N,N'-Trimethylurea; N,N'-Dimethyl-N-methylurea; Trimethylurea; 1,1,3-Trimethylurea; (CH3)2NCONHCH3; Urea, 1,1,3-trimethyl-; Trimethylharnstoff

Condensed phase thermochemistry data

Data compiled by: Hussein Y. Afeefy, Joel F. Liebman, and Stephen E. Stein
Quantity | Value | Units | Method | Reference | Comment |
---|---|---|---|---|---|
ΔfH°solid | -330.5 ± 4.2 | kJ/mol | Ccb | Tavernier and Lamouroux, 1956 | Reanalyzed by Cox and Pilcher, 1970, Original value = -324.88 kJ/mol; Author's hf298_condensed=-79.745 kcal/mol |
Quantity | Value | Units | Method | Reference | Comment |
ΔcH°solid | -2672.7 ± 4.2 | kJ/mol | Ccb | Tavernier and Lamouroux, 1956 | Reanalyzed by Cox and Pilcher, 1970, Original value = -2678.37 kJ/mol; Author's hf298_condensed=-79.745 kcal/mol |

Phase change data

Data compiled as indicated in comments:
BS - Robert L. Brown and Stephen E. Stein
AC - William E. Acree, Jr., James S. Chickos
DH - Eugene S. Domalski and Elizabeth D. Hearing
Quantity | Value | Units | Method | Reference | Comment |
---|---|---|---|---|---|
Tboil | 505.7 | K | N/A | Weast and Grasselli, 1989 | BS |
Reduced pressure boiling point
Tboil (K) | Pressure (bar) | Reference | Comment |
---|---|---|---|
400. to 401. | 0.021 | Frinton Laboratories Inc., 1986 | BS |
Enthalpy of vaporization
ΔvapH (kJ/mol) | Temperature (K) | Reference | Comment |
---|---|---|---|
89.7 ± 1.2 | 360. | Piacente, Ferro, et al., 1990 | Based on data from 345. to 375. K.; AC |
Enthalpy of fusion
ΔfusH (kJ/mol) | Temperature (K) | Reference | Comment |
---|---|---|---|
14.300 | 344.4 | Della Gatta and Ferro, 1987 | DH |
14.3 | 344.4 | Acree, 1991 | AC |
Entropy of fusion
ΔfusS (J/mol*K) | Temperature (K) | Reference | Comment |
---|---|---|---|
41.5 | 344.4 | Della Gatta and Ferro, 1987 | DH |

Gas phase ion energetics data

Data compiled as indicated in comments:
LLK - Sharon G. Lias, Rhoda D. Levin, and Sherif A. Kafafi
RDSH - Henry M. Rosenstock, Keith Draxl, Bruce W. Steiner, and John T. Herron
Ionization energy determinations
IE (eV) | Method | Reference | Comment |
---|---|---|---|
8.94 ± 0.05 | EI | Baldwin, Kirkien-Konasiewicz, et al., 1966 | RDSH |
8.80 | PE | Dougherty, Wittel, et al., 1976 | Vertical value; LLK |
Appearance energy determinations
Ion | AE (eV) | Other Products | Method | Reference | Comment |
---|---|---|---|---|---|
CH4N+ | 11.45 | ? | EI | Loudon and Webb, 1977 | LLK |
C2H4NO+ | 12.40 | ? | EI | Loudon and Webb, 1977 | LLK |
C2H6N+ | 11.70 | ? | EI | Loudon and Webb, 1977 | LLK |
C3H6NO+ | 12.40 | ? | EI | Loudon and Webb, 1977 | LLK |

Normal alkane RI, non-polar column, temperature ramp

Column type | Active phase | I | Reference | Comment |
---|---|---|---|---|
Capillary | OV-101 | 976. | Zenkevich, 2005 | 25. m/0.20 mm/0.10 μm, N2/He, 6. K/min; Tstart: 50. C; Tend: 250. C |

References

Tavernier and Lamouroux, 1956
Tavernier, P.; Lamouroux, M.,
Determinations calorimetriques relatives a vingt-six substances organiques,
Mem. Poudres, 1956, 38, 65-88. [all data]
Cox and Pilcher, 1970
Cox, J.D.; Pilcher, G.,
Thermochemistry of Organic and Organometallic Compounds, Academic Press, New York, 1970, 1-636. [all data]
Weast and Grasselli, 1989
CRC Handbook of Data on Organic Compounds, 2nd Editon, Weast,R.C and Grasselli, J.G., ed(s)., CRC Press, Inc., Boca Raton, FL, 1989, 1. [all data]
Frinton Laboratories Inc., 1986
Frinton Laboratories Inc.,
Catalog Number 11, Frinton Laboratories Inc., Vineland, NJ, 1986, 99. [all data]
Piacente, Ferro, et al., 1990
Piacente, V.; Ferro, D.; Gatta, G. Della,
Sublimation enthalpy of eleven alkyl derivatives of urea,
Thermochimica Acta, 1990, 158, 1, 79-85, https://doi.org/10.1016/0040-6031(90)80054-3
. [all data]
Della Gatta and Ferro, 1987
Della Gatta, G.; Ferro, D.,
Enthalpies of fusion and solid-to-solid transition, entropies of fusion for urea and twelve alkylureas,
Thermochim. Acta, 1987, 122, 143-152. [all data]
Acree, 1991
Acree, William E.,
Thermodynamic properties of organic compounds: enthalpy of fusion and melting point temperature compilation,
Thermochimica Acta, 1991, 189, 1, 37-56, https://doi.org/10.1016/0040-6031(91)87098-H
. [all data]
Baldwin, Kirkien-Konasiewicz, et al., 1966
Baldwin, M.; Kirkien-Konasiewicz, A.; Loudon, A.G.; Maccoll, A.; Smith, D.,
Localised or delocalised charges in molecule-ions?,
Chem. Commun., 1966, 574. [all data]
Dougherty, Wittel, et al., 1976
Dougherty, D.; Wittel, K.; Meeks, J.; McGlynn, S.P.,
Photoelectron spectroscopy of carbonyls. Ureas, uracils, and thymine,
J. Am. Chem. Soc., 1976, 98, 3815. [all data]
Loudon and Webb, 1977
Loudon, A.G.; Webb, K.S.,
The nature of the [C2H6N]+ and [CH4N]+ ions formed by electron impact on methylated formamides, acetamides, ureas, thioureas and hexamethylphosphoramide,
Org. Mass Spectrom., 1977, 12, 283. [all data]
Zenkevich, 2005
Zenkevich, I.G.,
Experimentally measured retention indices., 2005. [all data]