2-Pentynonitrile, 4,4-dimethyl-
- Formula: C7H9N
- Molecular weight: 107.1531
- IUPAC Standard InChIKey: AXIPPPLLWFZRCH-UHFFFAOYSA-N
- CAS Registry Number: 63212-76-0
- Chemical structure:
View 3d structure (requires JavaScript / HTML 5) - Permanent link for this species. Use this link for bookmarking this species for future reference.

Gas phase ion energetics data

Data compiled as indicated in comments:
LBLHLM - Sharon G. Lias, John E. Bartmess, Joel F. Liebman, John L. Holmes, Rhoda D. Levin, and W. Gary Mallard
LLK - Sharon G. Lias, Rhoda D. Levin, and Sherif A. Kafafi
Ionization energy determinations
IE (eV) | Method | Reference | Comment |
---|---|---|---|
10.02 | PI | Orlov, Boganov, et al., 1985 | LBLHLM |
Appearance energy determinations
Ion | AE (eV) | Other Products | Method | Reference | Comment |
---|---|---|---|---|---|
C6H6N+ | 10.30 | CH3 | PI | Orlov, Boganov, et al., 1985 | LBLHLM |
C6H6N+ | 10.30 ± 0.05 | CH3 | PI | Takhistov, Khlebnikova, et al., 1980 | LLK |

References

Orlov, Boganov, et al., 1985
Orlov, V.M.; Boganov, A.M.; Siretskaya, T.V.; Takhistov, V.V.,
Thermochemical characteristics of the molecular and fragmentation ions of substituted tert-butylacetylenes,
Izv. Akad. Nauk SSSR Ser. Khim., 1985, 12, 2795. [all data]
Takhistov, Khlebnikova, et al., 1980
Takhistov, V.; Khlebnikova, N.; Orlov, V.,
Photoionization study of energetic properties of cations formed with fragmentation of substituted acetylenes containing elements of IV B group,
Org. React. Tartu, 1980, 17, 449. [all data]