Ethanethioamide, N,N-dimethyl-
- Formula: C4H9NS
- Molecular weight: 103.186
- IUPAC Standard InChIKey: LKNQXZAHNDFIQY-UHFFFAOYSA-N
- CAS Registry Number: 631-67-4
- Chemical structure:
View 3d structure (requires JavaScript / HTML 5) - Other names: Acetamide, N,N-dimethylthio-; Dimethylthioacetamide; N,N-Dimethylthioacetamide; Dimethylthioacetamid; N,N-dimethylethanethioamide

Phase change data

Data compiled by: Robert L. Brown and Stephen E. Stein
Reduced pressure boiling point
Tboil (K) | Pressure (bar) | Reference |
---|---|---|
398. to 400. | 0.029 | Frinton Laboratories Inc., 1986 |

Gas phase ion energetics data

Data evaluated as indicated in comments:
HL - Edward P. Hunter and Sharon G. Lias
Data compiled as indicated in comments:
LLK - Sharon G. Lias, Rhoda D. Levin, and Sherif A. Kafafi
Quantity | Value | Units | Method | Reference | Comment |
---|---|---|---|---|---|
Proton affinity (review) | 925.3 | kJ/mol | N/A | Hunter and Lias, 1998 | HL |
Quantity | Value | Units | Method | Reference | Comment |
Gas basicity | 894.4 | kJ/mol | N/A | Hunter and Lias, 1998 | HL |
Ionization energy determinations
IE (eV) | Method | Reference | Comment |
---|---|---|---|
7.86 | PE | Mines and Thompson, 1975 | LLK |

References

Frinton Laboratories Inc., 1986
Frinton Laboratories Inc.,
Catalog Number 11, Frinton Laboratories Inc., Vineland, NJ, 1986, 99. [all data]
Hunter and Lias, 1998
Hunter, E.P.; Lias, S.G.,
Evaluated Gas Phase Basicities and Proton Affinities of Molecules: An Update,
J. Phys. Chem. Ref. Data, 1998, 27, 3, 413-656, https://doi.org/10.1063/1.556018
. [all data]
Mines and Thompson, 1975
Mines, G.W.; Thompson, H.W.,
The photoelectron spectra of amides, thioamides, ureas and thioureas,
Spectrochim. Acta, 1975, 31, 137. [all data]