Propanamide, 2-oxo-
- Formula: C3H5NO2
- Molecular weight: 87.0773
- IUPAC Standard InChIKey: FPOLWERNILTNDK-UHFFFAOYSA-N
- CAS Registry Number: 631-66-3
- Chemical structure:
View 3d structure (requires JavaScript / HTML 5) - Permanent link for this species. Use this link for bookmarking this species for future reference.

Gas phase ion energetics data

Data compiled by: Sharon G. Lias, Rhoda D. Levin, and Sherif A. Kafafi
Ionization energy determinations
IE (eV) | Method | Reference | Comment |
---|---|---|---|
9.71 | PE | McGlynn and Meeks, 1975 | Vertical value |

References

McGlynn and Meeks, 1975
McGlynn, S.P.; Meeks, J.L.,
Photoelectron spectra of carbonyls: Acetaldehyde, acetamide, biacetyl, pyruvic acid, methyl pyruvate and vamide,
J. Electron Spectrosc. Relat. Phenom., 1975, 6, 269. [all data]