Furan, 2-(2-pyrrolyl)-
- Formula: C8H7NO
- Molecular weight: 133.1473
- IUPAC Standard InChIKey: BYBZIJZNTITRID-UHFFFAOYSA-N
- CAS Registry Number: 63122-43-0
- Chemical structure:
View 3d structure (requires JavaScript / HTML 5) - Permanent link for this species. Use this link for bookmarking this species for future reference.

Gas phase ion energetics data

Data compiled as indicated in comments:
LLK - Sharon G. Lias, Rhoda D. Levin, and Sherif A. Kafafi
Ionization energy determinations
IE (eV) | Method | Reference | Comment |
---|---|---|---|
6.95 | PE | Galasso, Klasinc, et al., 1981 | LLK |
7.29 | PE | Galasso, Klasinc, et al., 1981 | Vertical value; LLK |

References

Galasso, Klasinc, et al., 1981
Galasso, V.; Klasinc, L.; Sabluic, A.; Trinajstic, N.; Pappalardo, G.C.; Steglich, W.,
Conformation and photoelectron spectra of 2-(2-Furyl)pyrrole and 2-(2-tThienyl)pyrrole,
J. Chem. Soc. Perkin Trans. 2, 1981, 127. [all data]