Propanal, 2,2-dimethyl-
- Formula: C5H10O
- Molecular weight: 86.1323
- IUPAC Standard InChIKey: FJJYHTVHBVXEEQ-UHFFFAOYSA-N
- CAS Registry Number: 630-19-3
- Chemical structure:

Reaction thermochemistry data

Data compiled as indicated in comments:
B - John E. Bartmess
M - Michael M. Meot-Ner (Mautner) and Sharon G. Lias
ALS - Hussein Y. Afeefy, Joel F. Liebman, and Stephen E. Stein
Individual Reactions
By formula: F- + C5H10O = (F- • C5H10O)
Quantity | Value | Units | Method | Reference | Comment |
---|---|---|---|---|---|
ΔrH° | 24.6 ± 2.0 | kcal/mol | IMRE | Larson and McMahon, 1983 | gas phase; B,M |
Quantity | Value | Units | Method | Reference | Comment |
ΔrS° | 26.2 | cal/mol*K | N/A | Larson and McMahon, 1983 | gas phase; switching reaction(F-)H2O, Entropy change calculated or estimated; Arshadi, Yamdagni, et al., 1970; M |
Quantity | Value | Units | Method | Reference | Comment |
ΔrG° | 16.8 ± 2.0 | kcal/mol | IMRE | Larson and McMahon, 1983 | gas phase; B,M |
By formula: Cl- + C5H10O = (Cl- • C5H10O)
Quantity | Value | Units | Method | Reference | Comment |
---|---|---|---|---|---|
ΔrH° | 15.0 ± 2.0 | kcal/mol | IMRE | Larson and McMahon, 1984 | gas phase; B,M |
Quantity | Value | Units | Method | Reference | Comment |
ΔrS° | 21.9 | cal/mol*K | N/A | Larson and McMahon, 1984 | gas phase; switching reaction(Cl-)CF3H, Entropy change calculated or estimated; Larson and McMahon, 1984, 2; M |
Quantity | Value | Units | Method | Reference | Comment |
ΔrG° | 8.4 ± 2.0 | kcal/mol | IMRE | Larson and McMahon, 1984 | gas phase; B,M |
C5H9O- + =
By formula: C5H9O- + H+ = C5H10O
Quantity | Value | Units | Method | Reference | Comment |
---|---|---|---|---|---|
ΔrH° | 387.4 ± 4.1 | kcal/mol | G+TS | Noest and Nibbering, 1980 | gas phase; B |
Quantity | Value | Units | Method | Reference | Comment |
ΔrG° | 381.0 ± 4.0 | kcal/mol | IMRB | Noest and Nibbering, 1980 | gas phase; B |
(CAS Reg. No. 55091-58-2 • 4294967295) +
= CAS Reg. No. 55091-58-2
By formula: (CAS Reg. No. 55091-58-2 • 4294967295C5H10O) + C5H10O = CAS Reg. No. 55091-58-2
Quantity | Value | Units | Method | Reference | Comment |
---|---|---|---|---|---|
ΔrH° | 45.6 ± 2.6 | kcal/mol | N/A | Bartmess, Scott, et al., 1979 | gas phase; value altered from reference due to change in acidity scale; B |
By formula: C7H16O2 + H2O = C5H10O + 2CH4O
Quantity | Value | Units | Method | Reference | Comment |
---|---|---|---|---|---|
ΔrH° | 7.925 ± 0.019 | kcal/mol | Eqk | Wiberg and Squires, 1981 | liquid phase; ALS |

Gas phase ion energetics data

Data evaluated as indicated in comments:
L - Sharon G. Lias
Data compiled as indicated in comments:
B - John E. Bartmess
LBLHLM - Sharon G. Lias, John E. Bartmess, Joel F. Liebman, John L. Holmes, Rhoda D. Levin, and W. Gary Mallard
LLK - Sharon G. Lias, Rhoda D. Levin, and Sherif A. Kafafi
Quantity | Value | Units | Method | Reference | Comment |
---|---|---|---|---|---|
IE (evaluated) | 9.51 ± 0.01 | eV | N/A | N/A | L |
Electron affinity determinations
EA (eV) | Method | Reference | Comment |
---|---|---|---|
0.000521 | EFD | Desfrancois, Abdoul-Carime, et al., 1994 | EA: 0.5 meV. Dipole-bound state.; B |
Ionization energy determinations
IE (eV) | Method | Reference | Comment |
---|---|---|---|
9.51 | PI | Traeger, 1985 | LBLHLM |
9.50 ± 0.01 | PE | Hernandez, Masclet, et al., 1977 | LLK |
9.51 ± 0.01 | PE | Cocksey, Eland, et al., 1971 | LLK |
Appearance energy determinations
Ion | AE (eV) | Other Products | Method | Reference | Comment |
---|---|---|---|---|---|
C3H5O+ | 9.64 | C2H5 | PI | Traeger, 1985 | LBLHLM |
De-protonation reactions
C5H9O- + =
By formula: C5H9O- + H+ = C5H10O
Quantity | Value | Units | Method | Reference | Comment |
---|---|---|---|---|---|
ΔrH° | 387.4 ± 4.1 | kcal/mol | G+TS | Noest and Nibbering, 1980 | gas phase; B |
Quantity | Value | Units | Method | Reference | Comment |
ΔrG° | 381.0 ± 4.0 | kcal/mol | IMRB | Noest and Nibbering, 1980 | gas phase; B |

Ion clustering data

Data compiled as indicated in comments:
B - John E. Bartmess
M - Michael M. Meot-Ner (Mautner) and Sharon G. Lias
Clustering reactions
By formula: Cl- + C5H10O = (Cl- • C5H10O)
Quantity | Value | Units | Method | Reference | Comment |
---|---|---|---|---|---|
ΔrH° | 15.0 ± 2.0 | kcal/mol | IMRE | Larson and McMahon, 1984 | gas phase; B,M |
Quantity | Value | Units | Method | Reference | Comment |
ΔrS° | 21.9 | cal/mol*K | N/A | Larson and McMahon, 1984 | gas phase; switching reaction(Cl-)CF3H, Entropy change calculated or estimated; Larson and McMahon, 1984, 2; M |
Quantity | Value | Units | Method | Reference | Comment |
ΔrG° | 8.4 ± 2.0 | kcal/mol | IMRE | Larson and McMahon, 1984 | gas phase; B,M |
By formula: F- + C5H10O = (F- • C5H10O)
Quantity | Value | Units | Method | Reference | Comment |
---|---|---|---|---|---|
ΔrH° | 24.6 ± 2.0 | kcal/mol | IMRE | Larson and McMahon, 1983 | gas phase; B,M |
Quantity | Value | Units | Method | Reference | Comment |
ΔrS° | 26.2 | cal/mol*K | N/A | Larson and McMahon, 1983 | gas phase; switching reaction(F-)H2O, Entropy change calculated or estimated; Arshadi, Yamdagni, et al., 1970; M |
Quantity | Value | Units | Method | Reference | Comment |
ΔrG° | 16.8 ± 2.0 | kcal/mol | IMRE | Larson and McMahon, 1983 | gas phase; B,M |

Kovats' RI, non-polar column, isothermal

Data compiled by: NIST Mass Spectrometry Data Center, William E. Wallace, director

Column type CapillaryCapillaryCapillaryCapillaryCapillary
Active phase HP-1HP-1HP-1HP-1HP-1
Column length (m) 50.50.50.50.50.
Carrier gas
Substrate
Column diameter (mm) 0.320.320.320.320.32
Phase thickness (μm) 1.051.051.051.051.05
Temperature (C) 110.30.50.70.90.
I 586.08580.50581.71583.28584.49
ReferenceHéberger, Görgényi, et al., 2002Héberger, Görgényi, et al., 2002Héberger, Görgényi, et al., 2002Héberger, Görgényi, et al., 2002Héberger, Görgényi, et al., 2002
Comment MSDC-RI MSDC-RI MSDC-RI MSDC-RI MSDC-RI
Column type CapillaryCapillaryCapillaryCapillaryPacked
Active phase HP-1HP-1HP-1HP-1Apiezon L
Column length (m) 50.50.50.50.
Carrier gas N2N2N2N2
Substrate     Celite 545
Column diameter (mm) 0.320.320.320.32
Phase thickness (μm) 1.051.051.051.05
Temperature (C) 110.50.70.90.120.
I 586.582.583.584.564.
ReferenceHéberger and Görgényi, 1999Héberger and Görgényi, 1999Héberger and Görgényi, 1999Héberger and Görgényi, 1999Bogoslovsky, Anvaer, et al., 1978
Comment MSDC-RI MSDC-RI MSDC-RI MSDC-RI MSDC-RI
Column type Packed
Active phase Apiezon L
Column length (m)
Carrier gas
Substrate Celite 545
Column diameter (mm)
Phase thickness (μm)
Temperature (C) 160.
I 575.
ReferenceBogoslovsky, Anvaer, et al., 1978
Comment MSDC-RI

Normal alkane RI, non-polar column, isothermal

Data compiled by: NIST Mass Spectrometry Data Center, William E. Wallace, director

Column type CapillaryPacked
Active phase OV-1Apieson L
Column length (m)
Carrier gas  not specified
Substrate  not specified
Column diameter (mm)
Phase thickness (μm)
Temperature (C) 60.120.
I 582.566.
ReferenceAmboni, Junkes, et al., 2002Kurdina, Markovich, et al., 1969
Comment MSDC-RI MSDC-RI

References

Larson and McMahon, 1983
Larson, J.W.; McMahon, T.B.,
Strong hydrogen bonding in gas-phase anions. An ion cyclotron resonance determination of fluoride binding energetics to bronsted acids from gas-phase fluoride exchange equilibria measurements,
J. Am. Chem. Soc., 1983, 105, 2944. [all data]
Arshadi, Yamdagni, et al., 1970
Arshadi, M.; Yamdagni, R.; Kebarle, P.,
Hydration of Halide Negative Ions in the Gas Phase. II. Comparison of Hydration Energies for the Alkali Positive and Halide Negative Ions,
J. Phys. Chem., 1970, 74, 7, 1475, https://doi.org/10.1021/j100702a014
. [all data]
Larson and McMahon, 1984
Larson, J.W.; McMahon, T.B.,
Hydrogen bonding in gas phase anions. An experimental investigation of the interaction between chloride ion and bronsted acids from ICR chloride exchange equilibria,
J. Am. Chem. Soc., 1984, 106, 517. [all data]
Larson and McMahon, 1984, 2
Larson, J.W.; McMahon, T.B.,
Gas phase negative ion chemistry of alkylchloroformates,
Can. J. Chem., 1984, 62, 675. [all data]
Noest and Nibbering, 1980
Noest, A.J.; Nibbering, N.M.M.,
Homoconjugation vs. charge dipole stabilization interaction effects in the stabilization of carbanions in the gas phase,
J. Am. Chem. Soc., 1980, 102, 6427. [all data]
Bartmess, Scott, et al., 1979
Bartmess, J.E.; Scott, J.A.; McIver, R.T., Jr.,
The gas phase acidity scale from methanol to phenol,
J. Am. Chem. Soc., 1979, 101, 6047. [all data]
Wiberg and Squires, 1981
Wiberg, K.B.; Squires, R.R.,
Thermochemical studies of carbonyl reactions. 2. Steric effects in acetal and ketal hydrolysis,
J. Am. Chem. Soc., 1981, 103, 4473-4478. [all data]
Desfrancois, Abdoul-Carime, et al., 1994
Desfrancois, C.; Abdoul-Carime, H.; Khelifa, N.; Schermann, J.P.,
Fork 1/r to 1/r2 Potentials: Electron Exchange between Rydberg Atoms and Polar Molecules,
Phys. Rev. Lett., 1994, 73, 18, 2436, https://doi.org/10.1103/PhysRevLett.73.2436
. [all data]
Traeger, 1985
Traeger, J.C.,
Heat of formation for the propanoyl cation by photoionization mass spectrometry,
Org. Mass Spectrom., 1985, 20, 223. [all data]
Hernandez, Masclet, et al., 1977
Hernandez, R.; Masclet, P.; Mouvier, G.,
Spectroscopie de photoelectrons d'aldehydes et de cetones aliphatiques,
J. Electron Spectrosc. Relat. Phenom., 1977, 10, 333. [all data]
Cocksey, Eland, et al., 1971
Cocksey, B.J.; Eland, J.H.D.; Danby, C.J.,
The effect of alkyl substitution on ionisation potential,
J. Chem. Soc., 1971, (B), 790. [all data]