Propane, 1-bromo-2,2-dimethyl-
- Formula: C5H11Br
- Molecular weight: 151.045
- IUPAC Standard InChIKey: CQWYAXCOVZKLHY-UHFFFAOYSA-N
- CAS Registry Number: 630-17-1
- Chemical structure:
View 3d structure (requires JavaScript / HTML 5) - Other names: Neopentyl bromide; 1-Bromo-2,2-dimethylpropane; (CH3)3CCH2Br

Phase change data

Data compiled as indicated in comments:
BS - Robert L. Brown and Stephen E. Stein
AC - William E. Acree, Jr., James S. Chickos
Quantity | Value | Units | Method | Reference | Comment |
---|---|---|---|---|---|
Tboil | 379.2 | K | N/A | Weast and Grasselli, 1989 | BS |
Reduced pressure boiling point
Tboil (K) | Pressure (bar) | Reference | Comment |
---|---|---|---|
378.7 | 1.02 | Aldrich Chemical Company Inc., 1990 | BS |
Enthalpy of vaporization
ΔvapH (kJ/mol) | Temperature (K) | Method | Reference | Comment |
---|---|---|---|---|
35.6 | 308. | A | Stephenson and Malanowski, 1987 | Based on data from 293. to 420. K. See also Dykyj, 1972.; AC |

Reaction thermochemistry data

Data compiled as indicated in comments:
B - John E. Bartmess
M - Michael M. Meot-Ner (Mautner) and Sharon G. Lias
Individual Reactions
By formula: Br- + C5H11Br = (Br- • C5H11Br)
Quantity | Value | Units | Method | Reference | Comment |
---|---|---|---|---|---|
ΔrH° | 60.25 | kJ/mol | TDAs | Dougherty, 1974 | gas phase; B,M |
Quantity | Value | Units | Method | Reference | Comment |
ΔrS° | 105. | J/mol*K | HPMS | Dougherty, 1974 | gas phase; M |
Quantity | Value | Units | Method | Reference | Comment |
ΔrG° | 28.9 | kJ/mol | TDAs | Dougherty, 1974 | gas phase; B |

Gas phase ion energetics data

Data compiled as indicated in comments:
LL - Sharon G. Lias and Joel F. Liebman
RDSH - Henry M. Rosenstock, Keith Draxl, Bruce W. Steiner, and John T. Herron
Ionization energy determinations
IE (eV) | Method | Reference | Comment |
---|---|---|---|
10.01 | EST | Luo and Pacey, 1992 | LL |
10.04 ± 0.015 | PE | Hashmall and Heilbronner, 1970 | RDSH |

Ion clustering data

Data compiled as indicated in comments:
B - John E. Bartmess
M - Michael M. Meot-Ner (Mautner) and Sharon G. Lias
Clustering reactions
By formula: Br- + C5H11Br = (Br- • C5H11Br)
Quantity | Value | Units | Method | Reference | Comment |
---|---|---|---|---|---|
ΔrH° | 60.25 | kJ/mol | TDAs | Dougherty, 1974 | gas phase; B,M |
Quantity | Value | Units | Method | Reference | Comment |
ΔrS° | 105. | J/mol*K | HPMS | Dougherty, 1974 | gas phase; M |
Quantity | Value | Units | Method | Reference | Comment |
ΔrG° | 28.9 | kJ/mol | TDAs | Dougherty, 1974 | gas phase; B |

References

Weast and Grasselli, 1989
CRC Handbook of Data on Organic Compounds, 2nd Editon, Weast,R.C and Grasselli, J.G., ed(s)., CRC Press, Inc., Boca Raton, FL, 1989, 1. [all data]
Aldrich Chemical Company Inc., 1990
Aldrich Chemical Company Inc.,
Catalog Handbook of Fine Chemicals, Aldrich Chemical Company, Inc., Milwaukee WI, 1990, 1. [all data]
Stephenson and Malanowski, 1987
Stephenson, Richard M.; Malanowski, Stanislaw,
Handbook of the Thermodynamics of Organic Compounds, 1987, https://doi.org/10.1007/978-94-009-3173-2
. [all data]
Dykyj, 1972
Dykyj, J.,
Petrochemia, 1972, 12, 1, 13. [all data]
Dougherty, 1974
Dougherty, R.C.,
SN2 reactions in the gas phase. Alkyl group structural effects,
Org. Mass Spectrom., 1974, 8, 85. [all data]
Luo and Pacey, 1992
Luo, Y.-R.; Pacey, P.D.,
Effects of alkyl substitution on ionization energies of alkanes and haloalkanes and on heats of formation of their molecular cations. Part 2. Alkanes and chloro-, bromo- and iodoalkanes,
Int. J. Mass Spectrom. Ion Processes, 1992, 112, 63. [all data]
Hashmall and Heilbronner, 1970
Hashmall, J.A.; Heilbronner, E.,
n-Ionization potentials of alkyl bromides,
Angew. Chem. Intern. Ed., 1970, 9, 305. [all data]