Methanesulfenic acid
- Formula: CH4OS
- Molecular weight: 64.107
- IUPAC Standard InChIKey: VLGWYKOEXANHJT-UHFFFAOYSA-N
- CAS Registry Number: 62965-22-4
- Chemical structure:
View 3d structure (requires JavaScript / HTML 5) - Permanent link for this species. Use this link for bookmarking this species for future reference.

Gas phase thermochemistry data

Data compiled by: Hussein Y. Afeefy, Joel F. Liebman, and Stephen E. Stein
Quantity | Value | Units | Method | Reference | Comment |
---|---|---|---|---|---|
ΔfH°gas | -190. | kJ/mol | Ion | Turecek, Brabec, et al., 1988 |

Reaction thermochemistry data

Data compiled by: John E. Bartmess
Individual Reactions
CH3OS- + =
By formula: CH3OS- + H+ = CH4OS
Quantity | Value | Units | Method | Reference | Comment |
---|---|---|---|---|---|
ΔrH° | 1502. ± 13. | kJ/mol | G+TS | Downard, Bowie, et al., 1992 | gas phase; Acid: MeS-O-H. Between CF3CH2OH, MeNO2. EA < SO2. |
Quantity | Value | Units | Method | Reference | Comment |
ΔrG° | 1473. ± 13. | kJ/mol | IMRB | Downard, Bowie, et al., 1992 | gas phase; Acid: MeS-O-H. Between CF3CH2OH, MeNO2. EA < SO2. |

Gas phase ion energetics data

Data compiled as indicated in comments:
B - John E. Bartmess
LL - Sharon G. Lias and Joel F. Liebman
Ionization energy determinations
IE (eV) | Method | Reference | Comment |
---|---|---|---|
9.07 ± 0.03 | EI | Turecek, Brabec, et al., 1988, 2 | LL |
De-protonation reactions
CH3OS- + =
By formula: CH3OS- + H+ = CH4OS
Quantity | Value | Units | Method | Reference | Comment |
---|---|---|---|---|---|
ΔrH° | 1502. ± 13. | kJ/mol | G+TS | Downard, Bowie, et al., 1992 | gas phase; Acid: MeS-O-H. Between CF3CH2OH, MeNO2. EA < SO2.; B |
Quantity | Value | Units | Method | Reference | Comment |
ΔrG° | 1473. ± 13. | kJ/mol | IMRB | Downard, Bowie, et al., 1992 | gas phase; Acid: MeS-O-H. Between CF3CH2OH, MeNO2. EA < SO2.; B |

Normal alkane RI, polar column, custom temperature program

Column type | Active phase | I | Reference | Comment |
---|---|---|---|---|
Capillary | EC-1000 | 1005. | Delabre and Bendall, 9999 | Program: not specified |

References

Turecek, Brabec, et al., 1988
Turecek, F.; Brabec, L.; Vondrak, t.; Hanus, V.; Hajicek, J.; Havlas, Z.,
Sulfenic acids in the gas phase. Preparation, ionization energies and heats of formation of methane-, ethene-, ethyne- and benzenesulfenic acid,
Collect. Czech. Chem. Commun., 1988, 53, 2140-2158. [all data]
Downard, Bowie, et al., 1992
Downard, K.M.; Bowie, J.H.; O'Hair, R.A.J.; Krempp, M.; DePuy, C.H.,
Gas Phase Reactions of the Methylsulfinyl and Methyldisulfide Anions,
Int. J. Mass Spectrom. Ion Proc., 1992, 120, 3, 217, https://doi.org/10.1016/0168-1176(92)85050-A
. [all data]
Turecek, Brabec, et al., 1988, 2
Turecek, F.; Brabec, L.; Vondrak, T.; Hanus, V.; Hajicek, J.; Havlas, Z.,
Sulfenic acids in the gas phase. Prepration, ionization energies and heats of gormation of methane-, ethene-, ethyne- and benzenesulfenic acid,
Collect. Czech. Chem. Commun., 1988, 53, 2140. [all data]
Delabre and Bendall, 9999
Delabre, M.-L.; Bendall, J.F.,
Flavour ingredients from fermented dairy streams,
Expression of Multidisciplinary Flavour Sci., 9999, 375-378. [all data]