1,3,2,4-Diazadistannetane, 1,3-di(tert-butyl)-2,2,4,4-tetramethyl-

Gas phase ion energetics data

Data compiled by: Sharon G. Lias and Joel F. Liebman

Ionization energy determinations

IE (eV) Method Reference Comment
6.7PEAndreocci, Cauletti, et al., 1991
7.11PEAndreocci, Cauletti, et al., 1991Vertical value

References

Andreocci, Cauletti, et al., 1991
Andreocci, M.V.; Cauletti, C.; Stranges, S., UV Photoelectron spectra and pseudopotential "ab initio" calculations of some 4-membered cyclic amides of group XIV elements, Z. Naturforsch. B:, 1991, 46, 39. [all data]