Disulfide, dibutyl
- Formula: C8H18S2
- Molecular weight: 178.359
- IUPAC Standard InChIKey: CUDSBWGCGSUXDB-UHFFFAOYSA-N
- CAS Registry Number: 629-45-8
- Chemical structure:
View 3d structure (requires JavaScript / HTML 5) - Other names: Butyl disulfide; Di-n-butyl disulfide; Dibutyl disulfide; Dibutyl disulphide; (n-C4H9S)2; n-Butyl disulfide; 5,6-Dithiadecane; NSC 36626

Gas phase thermochemistry data

Data compiled by: Hussein Y. Afeefy, Joel F. Liebman, and Stephen E. Stein
Quantity | Value | Units | Method | Reference | Comment |
---|---|---|---|---|---|
ΔfH°gas | -158.4 ± 2.6 | kJ/mol | Ccb | Mackle and McClean, 1964 | Reanalyzed by Cox and Pilcher, 1970, Original value = -157. ± 3. kJ/mol |

Condensed phase thermochemistry data

Data compiled by: Hussein Y. Afeefy, Joel F. Liebman, and Stephen E. Stein
Quantity | Value | Units | Method | Reference | Comment |
---|---|---|---|---|---|
ΔfH°liquid | -222.9 ± 2.0 | kJ/mol | Ccb | Mackle and McClean, 1964 | Reanalyzed by Cox and Pilcher, 1970, Original value = -222.0 ± 1.9 kJ/mol |
Quantity | Value | Units | Method | Reference | Comment |
ΔcH°liquid | -6702.3 ± 1.8 | kJ/mol | Ccb | Mackle and McClean, 1964 | Reanalyzed by Cox and Pilcher, 1970, Original value = -6695.0 ± 1.8 kJ/mol |

Phase change data

Data compiled as indicated in comments:
BS - Robert L. Brown and Stephen E. Stein
AC - William E. Acree, Jr., James S. Chickos
ALS - Hussein Y. Afeefy, Joel F. Liebman, and Stephen E. Stein
DRB - Donald R. Burgess, Jr.
Quantity | Value | Units | Method | Reference | Comment |
---|---|---|---|---|---|
Tboil | 504.2 | K | N/A | Aldrich Chemical Company Inc., 1990 | BS |
Quantity | Value | Units | Method | Reference | Comment |
ΔvapH° | 63. ± 2. | kJ/mol | AVG | N/A | Average of 6 values; Individual data points |

Gas phase ion energetics data

Data compiled as indicated in comments:
LLK - Sharon G. Lias, Rhoda D. Levin, and Sherif A. Kafafi
Ionization energy determinations
IE (eV) | Method | Reference | Comment |
---|---|---|---|
8.51 | PE | Guimon, Guimon, et al., 1975 | Vertical value; LLK |

Kovats' RI, non-polar column, isothermal

Column type | Active phase | Temperature (C) | I | Reference | Comment |
---|---|---|---|---|---|
Capillary | DB-5 | 100. | 1298.2 | Miller and Bruno, 2003 | 30. m/0.25 mm/0.1 μm |
Capillary | DB-5 | 120. | 1307.2 | Miller and Bruno, 2003 | 30. m/0.25 mm/0.1 μm |
Packed | Apiezon M | 130. | 1301. | Garbuzov, Misharina, et al., 1985 | He or N2, Chromosorb W, AW-DMCS; Column length: 2.1 m |
Packed | SE-30 | 110. | 1293. | Möckel and Zolg, 1977 | Chromosorb W AW (80-100 mesh); Column length: 2. m |
Capillary | E-301 | 150. | 1300. | Kudryavtseva, Fatalieva, et al., 1972 | |
Packed | DC-200 | 120. | 1288. | Golovnya and Arsen'ev, 1970 | Column length: 1.5 m |
Packed | SE-30 | 130. | 1289. | Golovnya and Arsen'ev, 1970 | Column length: 1.5 m |

Kovats' RI, polar column, isothermal

Column type | Active phase | Temperature (C) | I | Reference | Comment |
---|---|---|---|---|---|
Packed | Carbowax 20M | 110. | 1568. | Möckel and Zolg, 1977 | He, Chromosorb W AW (80-100 mesh); Column length: 6. m |

Normal alkane RI, non-polar column, isothermal

Column type | Active phase | Temperature (C) | I | Reference | Comment |
---|---|---|---|---|---|
Capillary | Polydimethyl siloxane with 5 % Ph groups | 100. | 1298. | Safa and Hadjmohannadi, 2005 | 30. m/0.25 mm/0.10 μm, Nitrogen |
Capillary | Polydimethyl siloxane with 5 % Ph groups | 120. | 1307. | Safa and Hadjmohannadi, 2005 | 30. m/0.25 mm/0.10 μm, Nitrogen |

Normal alkane RI, non-polar column, custom temperature program

Column type | Active phase | I | Reference | Comment |
---|---|---|---|---|
Capillary | SE-30 | 1295. | Vinogradov, 2004 | Program: not specified |
Capillary | Apieson M | 1301. | Gao, Wang, et al., 2003 | Program: not specified |

Normal alkane RI, polar column, custom temperature program

Column type | Active phase | I | Reference | Comment |
---|---|---|---|---|
Capillary | Carbowax 20M | 1580. | Vinogradov, 2004 | Program: not specified |
Capillary | PEG-1000 | 1592. | Gao, Wang, et al., 2003 | Program: not specified |
Capillary | DB-Wax | 1567. | Peng, Yang, et al., 1991 | Program: not specified |

References

Mackle and McClean, 1964
Mackle, H.; McClean, R.T.B.,
Studies in the thermochemistry of organic sulphides. Part 5.-Dithia-alkanes,
Trans. Faraday Soc., 1964, 60, 669-672. [all data]
Cox and Pilcher, 1970
Cox, J.D.; Pilcher, G.,
Thermochemistry of Organic and Organometallic Compounds, Academic Press, New York, 1970, 1-636. [all data]
Aldrich Chemical Company Inc., 1990
Aldrich Chemical Company Inc.,
Catalog Handbook of Fine Chemicals, Aldrich Chemical Company, Inc., Milwaukee WI, 1990, 1. [all data]
Guimon, Guimon, et al., 1975
Guimon, M.-F.; Guimon, C.; Pfister-Guillouzo, G.,
Application of photoelectron spectroscopy to conformational analysis of 1,2,4-trithiolanes,
Tetrahedron Lett., 1975, 7, 441. [all data]
Decker and Post, 1957
Decker, Q.W.; Post, H.W.,
Preparation and ultraviolet absorption spectra of certain alkyl polysulfides,
J. Org. Chem., 1957, 145-146. [all data]
Miller and Bruno, 2003
Miller, K.E.; Bruno, T.J.,
Isothermal Kováts retention indices of sulfur compounds on a poly(5% diphenyl-95% dimethylsiloxane) stationary phase,
J. Chromatogr. A, 2003, 1007, 1-2, 117-125, https://doi.org/10.1016/S0021-9673(03)00958-0
. [all data]
Garbuzov, Misharina, et al., 1985
Garbuzov, V.G.; Misharina, T.A.; Aerov, A.F.; Golovnya, R.V.,
Gas chromatographic retention indices for sulphur(II)-containing organic substances,
J. Anal. Chem. USSR (Engl. Transl.), 1985, 40, 4, 576-586. [all data]
Möckel and Zolg, 1977
Möckel, H.J.; Zolg, M.,
Retentionsindices n-aliphatischer Schwefelverbindungen,
Z. Anal. Chem., 1977, 285, 1, 45-46, https://doi.org/10.1007/BF00446017
. [all data]
Kudryavtseva, Fatalieva, et al., 1972
Kudryavtseva, N.A.; Fatalieva, A.A.; Lulova, N.I.; Vinogradova, I.E.,
Methods of assessing fuel and oil quality. Use of gas chromatography to identify components of decomposition products from Sul'fol antiscuff additive,
Chem. Technol. Fuels Oils (Engl. Transl.), 1972, 8, 10, 786-790, https://doi.org/10.1007/BF00717079
. [all data]
Golovnya and Arsen'ev, 1970
Golovnya, R.V.; Arsen'ev, Y.N.,
Gas-chromatographic method for the analysis of n-mercaptans and symmetrical n-sulfides and n-disulfides,
Bull. Acad. Sci. USSR, Div. Chem. Sci. (Engl. Transl.), 1970, 6, 4, 1316-1318, https://doi.org/10.1007/BF00852683
. [all data]
Safa and Hadjmohannadi, 2005
Safa, F.; Hadjmohannadi, M.R.,
Use of topological indices of organic sulfur compounds in quantitative structure-retention relationship study,
QSAR Comb. Sci., 2005, 24, 9, 1026-1032, https://doi.org/10.1002/qsar.200530008
. [all data]
Vinogradov, 2004
Vinogradov, B.A.,
Production, composition, properties and application of essential oils, 2004, retrieved from http://viness.narod.ru. [all data]
Gao, Wang, et al., 2003
Gao, Y.; Wang, Y.; Yao, X.; Zhang, X.; Liu, M.; Hu, Z.; Fan, B.,
The prediction for gas chromatographic retention index of disulfides on stationary phases of different polarity,
Talanta, 2003, 59, 2, 229-237, https://doi.org/10.1016/S0039-9140(02)00500-3
. [all data]
Peng, Yang, et al., 1991
Peng, C.T.; Yang, Z.C.; Ding, S.F.,
Prediction of rentention idexes. II. Structure-retention index relationship on polar columns,
J. Chromatogr., 1991, 586, 1, 85-112, https://doi.org/10.1016/0021-9673(91)80028-F
. [all data]