Mercury di-n-butyl
- Formula: C8H18Hg
- Molecular weight: 314.82
- IUPAC Standard InChIKey: CCYKQVBIPYDCKS-UHFFFAOYSA-N
- CAS Registry Number: 629-35-6
- Chemical structure:

Phase change data

Data compiled by: José A. Martinho Simões
Quantity | Value | Units | Method | Reference | Comment |
---|---|---|---|---|---|
ΔvapH° | 65.3 ± 4.2 | kJ/mol | CC-SB | Cox and Pilcher, 1970 |

Gas phase ion energetics data

Data compiled as indicated in comments:
LLK - Sharon G. Lias, Rhoda D. Levin, and Sherif A. Kafafi
RDSH - Henry M. Rosenstock, Keith Draxl, Bruce W. Steiner, and John T. Herron
Ionization energy determinations
IE (eV) | Method | Reference | Comment |
---|---|---|---|
8.35 | PE | Fehlner, Ulman, et al., 1976 | Vertical value; LLK |
Appearance energy determinations
Ion | AE (eV) | Other Products | Method | Reference | Comment |
---|---|---|---|---|---|
C4H9+ | 10.6 ± 0.1 | ? | EI | Gowenlock, Haynes, et al., 1962 | RDSH |

Gas phase thermochemistry data

Data compiled by: José A. Martinho Simões
Quantity | Value | Units | Method | Reference | Comment |
---|---|---|---|---|---|
ΔfH°gas | -7.7 ± 1.8 | kcal/mol | Review | Martinho Simões |

Condensed phase thermochemistry data

Data compiled by: José A. Martinho Simões
Quantity | Value | Units | Method | Reference | Comment |
---|---|---|---|---|---|
ΔfH°liquid | -23.4 ± 1.5 | kcal/mol | Review | Martinho Simões | |
Quantity | Value | Units | Method | Reference | Comment |
ΔcH°liquid | -1343.9 ± 1.5 | kcal/mol | CC-SB | Jones, Evans, et al., 1935 | Please also see Pedley and Rylance, 1977 and Cox and Pilcher, 1970. |

References

Cox and Pilcher, 1970
Cox, J.D.; Pilcher, G.,
Thermochemistry of Organic and Organometallic Compounds
in Academic Press, New York, 1970. [all data]
Fehlner, Ulman, et al., 1976
Fehlner, T.P.; Ulman, J.; Nugent, W.A.; Kochi, J.K.,
Effect of alkyl substituents on the first ionization potential and on 5d10 ionization in dialkylmercury compounds,
Inorg. Chem., 1976, 15, 2544. [all data]
Gowenlock, Haynes, et al., 1962
Gowenlock, B.G.; Haynes, R.M.; Majer, J.R.,
Electron impact measurement on some organomercury compounds,
J. Chem. Soc. Faraday Trans., 1962, 58, 1905. [all data]