4-Cyclopentene-1,3-dione, 2-diazo-
- Formula: C5H2N2O2
- Molecular weight: 122.0816
- IUPAC Standard InChIKey: MVEPTMGPCDMTSA-UHFFFAOYSA-N
- CAS Registry Number: 62926-66-3
- Chemical structure:
View 3d structure (requires JavaScript / HTML 5) - Permanent link for this species. Use this link for bookmarking this species for future reference.

Gas phase ion energetics data

Data compiled by: Sharon G. Lias, John E. Bartmess, Joel F. Liebman, John L. Holmes, Rhoda D. Levin, and W. Gary Mallard
Ionization energy determinations
IE (eV) | Method | Reference |
---|---|---|
9.51 | PE | Gleiter, Dobler, et al., 1982 |

References

Gleiter, Dobler, et al., 1982
Gleiter, R.; Dobler, W.; Eckert-Maksic, M.,
The electronic structure of o-tropoquinone, p-tropoquinone, and cyclopentene-1,2,3-trione - PE spectroscopic investigations,
Nouv. J. Chim., 1982, 6, 123. [all data]