Heptane, 1-bromo-
- Formula: C7H15Br
- Molecular weight: 179.098
- IUPAC Standard InChIKey: LSXKDWGTSHCFPP-UHFFFAOYSA-N
- CAS Registry Number: 629-04-9
- Chemical structure:
View 3d structure (requires JavaScript / HTML 5) - Other names: n-Heptyl bromide; Heptyl bromide; 1-Bromoheptane

Phase change data

Data compiled as indicated in comments:
BS - Robert L. Brown and Stephen E. Stein
TRC - Thermodynamics Research Center, NIST Boulder Laboratories, Chris Muzny director
AC - William E. Acree, Jr., James S. Chickos
ALS - Hussein Y. Afeefy, Joel F. Liebman, and Stephen E. Stein
Quantity | Value | Units | Method | Reference | Comment |
---|---|---|---|---|---|
Tboil | 453.2 | K | N/A | Aldrich Chemical Company Inc., 1990 | BS |
Tboil | 453. | K | N/A | Farchan Laboratories, 1990 | BS |
Tboil | 451.7 | K | N/A | Weast and Grasselli, 1989 | BS |
Quantity | Value | Units | Method | Reference | Comment |
Tfus | 214.9 | K | N/A | Timmermans, 1952 | Uncertainty assigned by TRC = 0.4 K; TRC |
Tfus | 217.1 | K | N/A | Crowe and Smyth, 1950 | Uncertainty assigned by TRC = 0.25 K; TRC |
Tfus | 214.4 | K | N/A | Crowe and Smyth, 1950 | Metastable crystal phase; Uncertainty assigned by TRC = 0.3 K; TRC |
Quantity | Value | Units | Method | Reference | Comment |
ΔvapH° | 50.5 ± 0.4 | kJ/mol | AVG | N/A | Average of 6 values; Individual data points |
Enthalpy of vaporization
ΔvapH (kJ/mol) | Temperature (K) | Method | Reference | Comment |
---|---|---|---|---|
47.0 | 356. | N/A | Dykyj, Svoboda, et al., 1999 | Based on data from 341. to 481. K.; AC |
47.5 | 348. | A,E | Stephenson and Malanowski, 1987 | Based on data from 333. to 483. K. See also Li and Rossini, 1961.; AC |
Enthalpy of fusion
ΔfusH (kJ/mol) | Temperature (K) | Reference | Comment |
---|---|---|---|
21.76 | 214.4 | Crowe and Smyth, 1950, 2 | AC |

Gas phase ion energetics data

Data compiled by: Sharon G. Lias and Joel F. Liebman
Ionization energy determinations
IE (eV) | Method | Reference |
---|---|---|
9.81 | EST | Luo and Pacey, 1992 |

Gas phase thermochemistry data

Data compiled by: Hussein Y. Afeefy, Joel F. Liebman, and Stephen E. Stein
Quantity | Value | Units | Method | Reference | Comment |
---|---|---|---|---|---|
ΔfH°gas | -40.69 ± 0.52 | kcal/mol | Ccr | Bjellerup, 1961 |

Condensed phase thermochemistry data

Data compiled as indicated in comments:
ALS - Hussein Y. Afeefy, Joel F. Liebman, and Stephen E. Stein
DH - Eugene S. Domalski and Elizabeth D. Hearing
Quantity | Value | Units | Method | Reference | Comment |
---|---|---|---|---|---|
ΔfH°liquid | -52.24 ± 0.39 | kcal/mol | Ccr | Bjellerup, 1961 | ALS |
Quantity | Value | Units | Method | Reference | Comment |
ΔcH°liquid | -1118.52 ± 0.38 | kcal/mol | Ccr | Bjellerup, 1961 | ALS |
Constant pressure heat capacity of liquid
Cp,liquid (cal/mol*K) | Temperature (K) | Reference | Comment |
---|---|---|---|
59.25 | 298.15 | Shehatta, 1993 | DH |

Kovats' RI, non-polar column, isothermal

View large format table.

Column type Active phase Temperature (C) I Reference Comment
PackedApolane130.1036.Dutoit, 1991Column length: 3.7 m
CapillarySqualane115.1018.Lafosse and Thuaud-Chourrout, 1975Column length: 100. m; Column diameter: 0.25 mm
PackedApiezon L100.1042.Brown, Chapman, et al., 1968N2, DCMS-treated Chromosorb W; Column length: 2.3 m
PackedApiezon L150.1061.Brown, Chapman, et al., 1968N2, DCMS-treated Chromosorb W; Column length: 2.3 m
PackedSE-30175.1067.Casteignau and Villessot, 1968Column length: 3. m

Kovats' RI, polar column, isothermal

View large format table.

Column type Active phase Temperature (C) I Reference Comment
PackedCarbowax 20M100.1268.Castello and D'Amato, 1985He, Chromosorb W AW DMCS; Column length: 3. m
PackedCarbowax 20M125.1262.Castello and D'Amato, 1985He, Chromosorb W AW DMCS; Column length: 3. m
PackedCarbowax 20M75.1252.Castello and D'Amato, 1985He, Chromosorb W AW DMCS; Column length: 3. m
PackedCarbowax 20M175.1282.Casteignau and Villessot, 1968Column length: 3. m

Van Den Dool and Kratz RI, non-polar column, custom temperature program

View large format table.

Column type Active phase I Reference Comment
CapillaryDB-11031.Peng, 200015. m/0.53 mm/1. μm, He; Program: 40C(3min) => 8C/min => 200(1min) => 5C/min => 300C(25min)

Van Den Dool and Kratz RI, polar column, temperature ramp

View large format table.

Column type Active phase I Reference Comment
CapillaryDB-Wax1266.Peng, 200015. m/0.53 mm/1. μm, He, 40. C @ 3. min, 5. K/min, 220. C @ 30. min
CapillaryHP-Wax1262.Peng, 200015. m/0.53 mm/1. μm, He, 40. C @ 3. min, 5. K/min, 220. C @ 30. min

Normal alkane RI, non-polar column, isothermal

View large format table.

Column type Active phase Temperature (C) I Reference Comment
CapillaryApiezon L130.1040.Arruda, Junkes, et al., 2008

Normal alkane RI, non-polar column, temperature ramp

View large format table.

Column type Active phase I Reference Comment
CapillaryOV-1011030.Dimov and Milina, 1989H2, 2. K/min; Column length: 50. m; Column diameter: 0.32 mm; Tstart: 40. C; Tend: 280. C

Normal alkane RI, non-polar column, custom temperature program

View large format table.

Column type Active phase I Reference Comment
CapillaryOV-1, SE-30, Methyl silicone, SP-2100, OV-101, DB-1, etc.1027.Waggott and Davies, 1984Hydrogen; Column length: 50. m; Column diameter: 0.32 mm; Program: not specified

Normal alkane RI, polar column, custom temperature program

View large format table.

Column type Active phase I Reference Comment
CapillaryDB-Wax1256.Peng, Yang, et al., 1991Program: not specified

References

Aldrich Chemical Company Inc., 1990
Aldrich Chemical Company Inc.,
Catalog Handbook of Fine Chemicals, Aldrich Chemical Company, Inc., Milwaukee WI, 1990, 1. [all data]
Farchan Laboratories, 1990
Farchan Laboratories,
Research Chemicals Catalog, Farchan Laboratories, Gainesville, FL, 1990, 91. [all data]
Weast and Grasselli, 1989
CRC Handbook of Data on Organic Compounds, 2nd Editon, Weast,R.C and Grasselli, J.G., ed(s)., CRC Press, Inc., Boca Raton, FL, 1989, 1. [all data]
Timmermans, 1952
Timmermans, J.,
Freezing points of organic compounds. VVI New determinations.,
Bull. Soc. Chim. Belg., 1952, 61, 393. [all data]
Crowe and Smyth, 1950
Crowe, R.W.; Smyth, C.P.,
Thermal and Dielectric Evidence of Polymorphism in Some Long-Chain n-Alkyl Bromides,
J. Am. Chem. Soc., 1950, 72, 3, 1098, https://doi.org/10.1021/ja01159a011
. [all data]
Dykyj, Svoboda, et al., 1999
Dykyj, J.; Svoboda, J.; Wilhoit, R.C.; Frenkel, M.L.; Hall, K.R.,
Vapor Pressure of Chemicals: Part A. Vapor Pressure and Antoine Constants for Hydrocarbons and Sulfur, Selenium, Tellurium and Hydrogen Containing Organic Compounds, Springer, Berlin, 1999, 373. [all data]
Stephenson and Malanowski, 1987
Stephenson, Richard M.; Malanowski, Stanislaw,
Handbook of the Thermodynamics of Organic Compounds, 1987, https://doi.org/10.1007/978-94-009-3173-2
. [all data]
Li and Rossini, 1961
Li, J.C.M.; Rossini, F.D.,
Vapor Pressures and Boiling Points of the l-Fluoroalkanes, l-Chloroalkanes, l-Bromoalkanes, and l-Iodoalkanes, C 1 to C 20 .,
J. Chem. Eng. Data, 1961, 6, 2, 268-270, https://doi.org/10.1021/je60010a025
. [all data]
Crowe and Smyth, 1950, 2
Crowe, Robert W.; Smyth, Charles P.,
Thermal and Dielectric Evidence of Polymorphism in Some Long-Chain n-Alkyl Bromides 1,
J. Am. Chem. Soc., 1950, 72, 3, 1098-1106, https://doi.org/10.1021/ja01159a011
. [all data]
Luo and Pacey, 1992
Luo, Y.-R.; Pacey, P.D.,
Effects of alkyl substitution on ionization energies of alkanes and haloalkanes and on heats of formation of their molecular cations. Part 2. Alkanes and chloro-, bromo- and iodoalkanes,
Int. J. Mass Spectrom. Ion Processes, 1992, 112, 63. [all data]