Di-n-propyl mercury
- Formula: C6H14Hg
- Molecular weight: 286.77
- CAS Registry Number: 628-85-3

Gas phase thermochemistry data

Data compiled by: José A. Martinho Simões
Quantity | Value | Units | Method | Reference | Comment |
---|---|---|---|---|---|
ΔfH°gas | 34.6 ± 4.5 | kJ/mol | Review | Martinho Simões | |
ΔfH°gas | 26.0 ± 6.6 | kJ/mol | Review | Martinho Simões | |
ΔfH°gas | 30.3 ± 5.2 | kJ/mol | Review | Martinho Simões | Selected data. Average of the values from Jones, Evans, et al., 1935 and Mortimer, Pritchard, et al., 1952. |

Condensed phase thermochemistry data

Data compiled by: José A. Martinho Simões
Quantity | Value | Units | Method | Reference | Comment |
---|---|---|---|---|---|
ΔfH°liquid | -20.6 ± 4.3 | kJ/mol | Review | Martinho Simões | |
ΔfH°liquid | -29.2 ± 6.5 | kJ/mol | Review | Martinho Simões | |
ΔfH°liquid | -24.9 ± 5.0 | kJ/mol | Review | Martinho Simões | Selected data. Average of the values from Jones, Evans, et al., 1935 and Mortimer, Pritchard, et al., 1952. |
Quantity | Value | Units | Method | Reference | Comment |
ΔcH°liquid | -4341.3 ± 4.2 | kJ/mol | CC-SB | Jones, Evans, et al., 1935 | Please also see Cox and Pilcher, 1970. |

Gas phase ion energetics data

Data compiled as indicated in comments:
LLK - Sharon G. Lias, Rhoda D. Levin, and Sherif A. Kafafi
Ionization energy determinations
IE (eV) | Method | Reference | Comment |
---|---|---|---|
8.29 | PE | Fehlner, Ulman, et al., 1976 | Vertical value; LLK |

Phase change data

Data compiled by: José A. Martinho Simões
Quantity | Value | Units | Method | Reference | Comment |
---|---|---|---|---|---|
ΔvapH° | 55.2 ± 1.3 | kJ/mol | CC-SB | Tees, 1952 |

Reaction thermochemistry data

Data compiled as indicated in comments:
MS - José A. Martinho Simões
ALS - Hussein Y. Afeefy, Joel F. Liebman, and Stephen E. Stein
Individual Reactions
C6H14Hg (l) + (cr) = 2C3H7HgI (cr)
By formula: C6H14Hg (l) + HgI2 (cr) = 2C3H7HgI (cr)
Quantity | Value | Units | Method | Reference | Comment |
---|---|---|---|---|---|
ΔrH° | -12.6 ± 0.41 | kcal/mol | RSC | Mortimer, Pritchard, et al., 1952 | Please also see Pedley and Rylance, 1977 and Cox and Pilcher, 1970.; MS |
C6H14Hg (l) + Cl2Hg (cr) = 2C3H7ClHg (cr)
By formula: C6H14Hg (l) + Cl2Hg (cr) = 2C3H7ClHg (cr)
Quantity | Value | Units | Method | Reference | Comment |
---|---|---|---|---|---|
ΔrH° | -21.2 ± 0.31 | kcal/mol | RSC | Mortimer, Pritchard, et al., 1952 | Please also see Pedley and Rylance, 1977 and Cox and Pilcher, 1970.; MS |
C6H14Hg (l) + (cr) = 2C3H7BrHg (cr)
By formula: C6H14Hg (l) + Br2Hg (cr) = 2C3H7BrHg (cr)
Quantity | Value | Units | Method | Reference | Comment |
---|---|---|---|---|---|
ΔrH° | -18.1 ± 0.31 | kcal/mol | RSC | Mortimer, Pritchard, et al., 1952 | Please also see Pedley and Rylance, 1977 and Cox and Pilcher, 1970.; MS |
By formula: 2C3H7I + HgI2 = C6H14Hg + 2I2
Quantity | Value | Units | Method | Reference | Comment |
---|---|---|---|---|---|
ΔrH° | 51.56 ± 0.58 | kcal/mol | Cm | Mortimer, Pritchard, et al., 1952, 2 | liquid phase; ALS |

References

Martinho Simões
Martinho Simões, J.A.,
Private communication (see http://webbook.nist.gov/chemistry/om/). [all data]
Jones, Evans, et al., 1935
Jones, W.J.; Evans, D.P.; Gulwell, T.; Griffiths, D.C.,
J. Chem. Soc., 1935, 39.. [all data]
Mortimer, Pritchard, et al., 1952
Mortimer, C.T.; Pritchard, H.O.; Skinner, H.A.,
Thermochemistry of metallic alkyls. Part V.?Mercury di-propyl and mercury di-isopropyl,
Trans. Faraday Soc., 1952, 48, 220, https://doi.org/10.1039/tf9524800220
. [all data]
Cox and Pilcher, 1970
Cox, J.D.; Pilcher, G.,
Thermochemistry of Organic and Organometallic Compounds
in Academic Press, New York, 1970. [all data]
Fehlner, Ulman, et al., 1976
Fehlner, T.P.; Ulman, J.; Nugent, W.A.; Kochi, J.K.,
Effect of alkyl substituents on the first ionization potential and on 5d10 ionization in dialkylmercury compounds,
Inorg. Chem., 1976, 15, 2544. [all data]