Pentane, 1-methoxy-
- Formula: C6H14O
- Molecular weight: 102.1748
- IUPAC Standard InChIKey: DBUJFULDVAZULB-UHFFFAOYSA-N
- CAS Registry Number: 628-80-8
- Chemical structure:
View 3d structure (requires JavaScript / HTML 5) - Other names: Ether, methyl pentyl; n-Amyl methyl ether; Amyl methyl ether; Methyl amyl ether; Methyl pentyl ether; n-C5H11OCH3; 1-Methoxypentane; Pentyl methyl ether

Phase change data

Data compiled as indicated in comments:
BS - Robert L. Brown and Stephen E. Stein
TRC - Thermodynamics Research Center, NIST Boulder Laboratories, Chris Muzny director
Quantity | Value | Units | Method | Reference | Comment |
---|---|---|---|---|---|
Tboil | 372.7 | K | N/A | Weast and Grasselli, 1989 | BS |
Tboil | 372. | K | N/A | Majer and Svoboda, 1985 | |
Quantity | Value | Units | Method | Reference | Comment |
Tc | 546.53 | K | N/A | Zawisza and Glowka, 1971 | Uncertainty assigned by TRC = 1. K; TRC |
Tc | 546.49 | K | N/A | Osipiuk and Stryjek, 1970 | Uncertainty assigned by TRC = 2. K; TRC |
Quantity | Value | Units | Method | Reference | Comment |
Pc | 30.42 | bar | N/A | Zawisza and Glowka, 1971 | Uncertainty assigned by TRC = 0.5066 bar; TRC |
Quantity | Value | Units | Method | Reference | Comment |
Vc | 0.392 | l/mol | N/A | Zawisza and Glowka, 1971 | Uncertainty assigned by TRC = 0.003 l/mol; TRC |
Quantity | Value | Units | Method | Reference | Comment |
ρc | 2.63 | mol/l | N/A | Osipiuk and Stryjek, 1970 | Uncertainty assigned by TRC = 0.04 mol/l; TRC |
Quantity | Value | Units | Method | Reference | Comment |
ΔvapH° | 36.91 | kJ/mol | N/A | Majer and Svoboda, 1985 |
Enthalpy of vaporization
ΔvapH (kJ/mol) | Temperature (K) | Reference | Comment |
---|---|---|---|
32.02 | 372. | Majer and Svoboda, 1985 |

Gas phase ion energetics data

Data compiled by: Sharon G. Lias, Rhoda D. Levin, and Sherif A. Kafafi
Ionization energy determinations
IE (eV) | Method | Reference | Comment |
---|---|---|---|
9.67 | PE | Bachiri, Mouvier, et al., 1980 | Vertical value |

Van Den Dool and Kratz RI, non-polar column, temperature ramp

Column type | Active phase | I | Reference | Comment |
---|---|---|---|---|
Capillary | CP Sil 5 CB | 708. | Pino, Marbot, et al., 2002 | 50. m/0.32 mm/0.4 μm, He, 60. C @ 10. min, 3. K/min, 280. C @ 60. min |

Van Den Dool and Kratz RI, non-polar column, custom temperature program

Column type | Active phase | I | Reference | Comment |
---|---|---|---|---|
Capillary | VF-5MS | 722.1 | Tret'yakov, 2007 | 30. m/0.25 mm/0.25 μm, He; Program: Multi-step temperature program; T(initial)=60C; T(final)=270C |

Van Den Dool and Kratz RI, polar column, temperature ramp

Column type | Active phase | I | Reference | Comment |
---|---|---|---|---|
Capillary | AT-Wax | 774. | Pino, Marbot, et al., 2002 | 60. m/0.32 mm/0.25 μm, He, 65. C @ 10. min, 2. K/min, 250. C @ 60. min |

Normal alkane RI, non-polar column, custom temperature program

Column type | Active phase | I | Reference | Comment |
---|---|---|---|---|
Packed | Apiezon L | 705.0 | Keiko, Prokop'ev, et al., 1972 | Program: not specified |
Packed | Squalane | 708.0 | Keiko, Prokop'ev, et al., 1972 | Program: not specified |

References

Weast and Grasselli, 1989
CRC Handbook of Data on Organic Compounds, 2nd Editon, Weast,R.C and Grasselli, J.G., ed(s)., CRC Press, Inc., Boca Raton, FL, 1989, 1. [all data]
Majer and Svoboda, 1985
Majer, V.; Svoboda, V.,
Enthalpies of Vaporization of Organic Compounds: A Critical Review and Data Compilation, Blackwell Scientific Publications, Oxford, 1985, 300. [all data]
Zawisza and Glowka, 1971
Zawisza, A.C.; Glowka, S.,
Liquid-vapor equilibriums and thermodynamic functions of methyl n-butyl ether-sulfur dioxide and methyl n-pentyl ether-sulfur dioxide systems up to 300.deg. and 77.81 atm,
Bull. Acad. Pol. Sci., Ser. Sci. Chim., 1971, 19, 191. [all data]
Osipiuk and Stryjek, 1970
Osipiuk, B.; Stryjek, R.,
Second virial coefficients of binary methyl n-alkyl ether - sulfur dioxide mixtures,
Bull. Acad. Pol. Sci., Ser. Sci. Chim., 1970, 18, 289-95. [all data]
Bachiri, Mouvier, et al., 1980
Bachiri, M.; Mouvier, G.; Carlier, P.; Dubois, J.E.,
Evaluation quantitative des effets de substituants sur les premiers potentiels d'ionisation de composes monofonctionnels aliphatiques,
J. Chim. Phys., 1980, 77, 899. [all data]
Pino, Marbot, et al., 2002
Pino, J.A.; Marbot, R.; Vázquez, C.,
Characterization of volatile in Cosa Rican Guava [Psidium friedrichsthalianum (Berg) Niedenzu] fruit,
J. Agric. Food Chem., 2002, 50, 21, 6023-6026, https://doi.org/10.1021/jf011456i
. [all data]
Tret'yakov, 2007
Tret'yakov, K.V.,
Retention Data. NIST Mass Spectrometry Data Center., NIST Mass Spectrometry Data Center, 2007. [all data]
Keiko, Prokop'ev, et al., 1972
Keiko, V.V.; Prokop'ev, B.V.; Kuz'menko, L.P.; Kalinina, N.A.; Modonov, V.B.,
The use of an additive scheme of calculation of the indices of retention in gas-liquid chromatography communication. 3. Some regularities in the manifestation of the inductive effect,
Izv. Akad. Nauk Kaz. SSR Ser. Khim., 1972, 12, 2629-2633. [all data]