Hexanenitrile
- Formula: C6H11N
- Molecular weight: 97.1582
- IUPAC Standard InChIKey: AILKHAQXUAOOFU-UHFFFAOYSA-N
- CAS Registry Number: 628-73-9
- Chemical structure:
View 3d structure (requires JavaScript / HTML 5) - Other names: Capronitrile; Hexanonitrile; Pentyl cyanide; Tricapronile; 1-Cyanopentane; n-Amyl cyanide; n-Caproic nitrile; n-Capronitrile; n-Pentyl cyanide; NSC 1076

Phase change data

Data compiled as indicated in comments:
BS - Robert L. Brown and Stephen E. Stein
TRC - Thermodynamics Research Center, NIST Boulder Laboratories, Chris Muzny director
ALS - Hussein Y. Afeefy, Joel F. Liebman, and Stephen E. Stein
AC - William E. Acree, Jr., James S. Chickos
Quantity | Value | Units | Method | Reference | Comment |
---|---|---|---|---|---|
Tboil | 435. ± 5. | K | AVG | N/A | Average of 17 out of 18 values; Individual data points |
Quantity | Value | Units | Method | Reference | Comment |
Tfus | 184.15 | K | N/A | Timmermans, 1952 | Uncertainty assigned by TRC = 1.5 K; TRC |
Tfus | 192.84 | K | N/A | Dreisbach and Martin, 1949 | Uncertainty assigned by TRC = 0.05 K; TRC |
Tfus | 193.75 | K | N/A | Simon, 1929 | Uncertainty assigned by TRC = 1. K; TRC |
Tfus | 228.15 | K | N/A | Jaeger and Kahn, 1915 | TRC |
Quantity | Value | Units | Method | Reference | Comment |
Tc | 633.8 | K | N/A | Castillo-Lopez and Trejo Rodriguez, 1987 | Uncertainty assigned by TRC = 0.2 K; Visual, TE with digital voltmeter cal. by meas. on alkanes.; TRC |
Tc | 621.8 | K | N/A | Guye and Mallet, 1902 | Uncertainty assigned by TRC = 2.5 K; TRC |
Tc | 622.05 | K | N/A | Guye and Mallet, 1902, 2 | Uncertainty assigned by TRC = 1. K; TRC |
Tc | 621.75 | K | N/A | Guye and Mallet, 1902, 2 | Uncertainty assigned by TRC = 1. K; TRC |
Quantity | Value | Units | Method | Reference | Comment |
Pc | 32.6 ± 0.4 | bar | AVG | N/A | Average of 6 values; Individual data points |
Quantity | Value | Units | Method | Reference | Comment |
ΔvapH° | 47.91 | kJ/mol | N/A | Majer and Svoboda, 1985 | |
ΔvapH° | 47.91 ± 0.10 | kJ/mol | V | Howard and Wadso, 1970 | ALS |
ΔvapH° | 47.9 ± 0.1 | kJ/mol | C | Howard, Wadsö, et al., 1970 | AC |
ΔvapH° | 49.1 | kJ/mol | EB | Dreisbach and Shrader, 1949 | Based on data from 365. to 437. K. See also Dreisbach and Martin, 1949, 2 and Emel'yanenko, Verevkin, et al., 2005.; AC |
ΔvapH° | 47.7 ± 0.1 | kJ/mol | MM | Heim, 1933 | Based on data from 293. to 452. K. See also Emel'yanenko, Verevkin, et al., 2005.; AC |
Enthalpy of vaporization
ΔvapH (kJ/mol) | Temperature (K) | Method | Reference | Comment |
---|---|---|---|---|
43.3 | 386. | A,EB | Stephenson and Malanowski, 1987 | Based on data from 371. to 442. K. See also Meyer and Hotz, 1973.; AC |
44.6 | 359. | EB | Meyer, Renner, et al., 1971 | Based on data from 344. to 441. K.; AC |
Antoine Equation Parameters
log10(P) = A − (B / (T + C))
P = vapor pressure (bar)
T = temperature (K)
View plot Requires a JavaScript / HTML 5 canvas capable browser.
Temperature (K) | A | B | C | Reference | Comment |
---|---|---|---|---|---|
371.23 to 441.66 | 4.1961 ± 0.0013 | 1553.81 ± 0.89 | -65.811 ± 0.097 | Meyer and Hotz, 1973 | |
365.13 to 436.80 | 4.10819 | 1502.715 | -70.588 | Dreisbach and Shrader, 1949 | Coefficents calculated by NIST from author's data. |

Gas phase ion energetics data

Data compiled as indicated in comments:
MM - Michael M. Meot-Ner (Mautner)
RDSH - Henry M. Rosenstock, Keith Draxl, Bruce W. Steiner, and John T. Herron
Proton affinity at 298K
Proton affinity (kJ/mol) | Reference | Comment |
---|---|---|
804.6 | Cao and Holmes, 1999 | MM |
806. | Cao and Holmes, 1999 | MM |
Appearance energy determinations
Ion | AE (eV) | Other Products | Method | Reference | Comment |
---|---|---|---|---|---|
C6H10N+ | 12.62 | H | EI | Heerma, deRidder, et al., 1969 | RDSH |

Normal alkane RI, non-polar column, custom temperature program

Data compiled by: NIST Mass Spectrometry Data Center, William E. Wallace, director

Column type CapillaryCapillaryCapillary
Active phase DB-5 MSMethyl SiliconeDB-1
Column length (m) 30. 60.
Carrier gas Helium
Substrate
Column diameter (mm) 0.25 0.32
Phase thickness (μm) 0.25
Program 45 0C (0.75 min) 10 0C/min -> 200 0C 30 0C/min -> 245 0C (1.25 min)not specifiednot specified
I 880.822.840.
ReferenceCajka, Hajslova, et al., 2007N/AButtery, Teranishi, et al., 1990
Comment MSDC-RI MSDC-RI MSDC-RI

Normal alkane RI, polar column, temperature ramp

Data compiled by: NIST Mass Spectrometry Data Center, William E. Wallace, director

Column type Capillary
Active phase Innowax
Column length (m) 50.
Carrier gas He
Substrate
Column diameter (mm) 0.2
Phase thickness (μm) 0.5
Tstart (C) 60.
Tend (C) 250.
Heat rate (K/min) 2.
Initial hold (min)
Final hold (min) 60.
I 1303.
ReferenceBendimerad and Bendiab, 2005
Comment MSDC-RI

References

Timmermans, 1952
Timmermans, J.,
Freezing points of organic compounds. VVI New determinations.,
Bull. Soc. Chim. Belg., 1952, 61, 393. [all data]
Dreisbach and Martin, 1949
Dreisbach, R.R.; Martin, R.A.,
Physical Data on Some Organic Compounds,
Ind. Eng. Chem., 1949, 41, 2875-8. [all data]
Simon, 1929
Simon, I.,
Freezing Temperature of Organic Compounds. XI. Compounds in C5 and C6.,
Bull. Soc. Chim. Belg., 1929, 38, 47-70. [all data]
Jaeger and Kahn, 1915
Jaeger, F.M.; Kahn, J.,
The temperature-coefficients of the free molecular surface energy of liquids between -80!31 and 1650!31: x measurements relating to a series of aliphatic compounds,
J. Chem. Soc., 1915, 108, 747-48. [all data]
Castillo-Lopez and Trejo Rodriguez, 1987
Castillo-Lopez, N.; Trejo Rodriguez, A.,
The critical temperatures and pressures of several n-alkanenitriles,
J. Chem. Thermodyn., 1987, 19, 671. [all data]
Guye and Mallet, 1902
Guye, P.A.; Mallet, E.,
Critical Constant and Molecular Complexity of Several Organic Compds.,
C. R. Hebd. Seances Acad. Sci., 1902, 133, 168. [all data]
Guye and Mallet, 1902, 2
Guye, P.A.; Mallet, E.,
Measurement of Critical Constants,
Arch. Sci. Phys. Nat., 1902, 13, 274-296. [all data]
Majer and Svoboda, 1985
Majer, V.; Svoboda, V.,
Enthalpies of Vaporization of Organic Compounds: A Critical Review and Data Compilation, Blackwell Scientific Publications, Oxford, 1985, 300. [all data]
Howard and Wadso, 1970
Howard, P.B.; Wadso, I.,
Enthalpies of vaporization of organic compounds IV. Alkyl Nitriles,
Acta Chem. Scand., 1970, 24, 145. [all data]
Howard, Wadsö, et al., 1970
Howard, Peter B.; Wadsö, Ingemar; Nyborg, Jens; Ragnarsson, Ulf; Rasmussen, S.E.; Sunde, Erling; Sørensen, Nils Andreas,
Enthalpies of Vaporization of Organic Compounds. IV. Alkyl Nitriles.,
Acta Chem. Scand., 1970, 24, 145-149, https://doi.org/10.3891/acta.chem.scand.24-0145
. [all data]
Dreisbach and Shrader, 1949
Dreisbach, R.R.; Shrader, S.A.,
Vapor Pressure--Temperature Data on Some Organic Compounds,
Ind. Eng. Chem., 1949, 41, 12, 2879-2880, https://doi.org/10.1021/ie50480a054
. [all data]
Dreisbach and Martin, 1949, 2
Dreisbach, R.R.; Martin, R.A.,
Physical Data on Some Organic Compounds,
Ind. Eng. Chem., 1949, 41, 12, 2875-2878, https://doi.org/10.1021/ie50480a053
. [all data]
Emel'yanenko, Verevkin, et al., 2005
Emel'yanenko, Vladimir N.; Verevkin, Sergey P.; Koutek, Bohumir; Doubsky, Jan,
Vapour pressures and enthalpies of vapourization of a series of the linear aliphatic nitriles,
The Journal of Chemical Thermodynamics, 2005, 37, 1, 73-81, https://doi.org/10.1016/j.jct.2004.08.004
. [all data]
Heim, 1933
Heim, G.,
Bull. Soc. Chim. Belg., 1933, 42, 467. [all data]
Stephenson and Malanowski, 1987
Stephenson, Richard M.; Malanowski, Stanislaw,
Handbook of the Thermodynamics of Organic Compounds, 1987, https://doi.org/10.1007/978-94-009-3173-2
. [all data]
Meyer and Hotz, 1973
Meyer, Edwin F.; Hotz, Roger D.,
High-precision vapor-pressure data for eight organic compounds,
J. Chem. Eng. Data, 1973, 18, 4, 359-362, https://doi.org/10.1021/je60059a008
. [all data]
Meyer, Renner, et al., 1971
Meyer, Edwin F.; Renner, Terrence A.; Stec, Kenneth S.,
Cohesive energies in polar organic liquids. II. n-Alkane nitriles and the 1-chloro alkanes,
J. Phys. Chem., 1971, 75, 5, 642-648, https://doi.org/10.1021/j100675a008
. [all data]
Cao and Holmes, 1999
Cao, J.; Holmes, J.L.,
Determining the proton affinities of nitriles by the kinetic method,
European J. Mass Spectrometry, 1999, 5, 19-22. [all data]
Heerma, deRidder, et al., 1969
Heerma, W.; deRidder, J.J.; Dijkstra, G.,
The electron-impact-induced fragmentation of n-alkyl cyanides,
Org. Mass Spectrom., 1969, 2, 1103. [all data]