2,4-Heptadiene
- Formula: C7H12
- Molecular weight: 96.1702
- IUPAC Standard InChIKey: XTJLXXCARCJVPJ-UHFFFAOYSA-N
- CAS Registry Number: 628-72-8
- Chemical structure:
View 3d structure (requires JavaScript / HTML 5) - Stereoisomers:

Phase change data

Data compiled as indicated in comments:
BS - Robert L. Brown and Stephen E. Stein
TRC - Thermodynamics Research Center, NIST Boulder Laboratories, Chris Muzny director
Quantity | Value | Units | Method | Reference | Comment |
---|---|---|---|---|---|
Tboil | 381.2 | K | N/A | Weast and Grasselli, 1989 | BS |
Tboil | 382.6 | K | N/A | Gorin and Vasil'eva, 1954 | Uncertainty assigned by TRC = 2. K; TRC |
Tboil | 382.8 | K | N/A | Henne and Turk, 1942 | Uncertainty assigned by TRC = 2. K; TRC |
Tboil | 377. | K | N/A | Karasev and Khabarova, 1940 | Uncertainty assigned by TRC = 2. K; TRC |
Tboil | 378. | K | N/A | Reif, 1908 | Uncertainty assigned by TRC = 3. K; TRC |

Gas phase ion energetics data

Data compiled by: Sharon G. Lias, Rhoda D. Levin, and Sherif A. Kafafi
Ionization energy determinations
IE (eV) | Method | Reference | Comment |
---|---|---|---|
8.17 | PE | Masclet, Mouvier, et al., 1981 | Vertical value |

Normal alkane RI, non-polar column, temperature ramp

Column type | Active phase | I | Reference | Comment |
---|---|---|---|---|
Capillary | OV-101 | 750. | Chupalov and Zenkevich, 1996 | N2, 3. K/min; Column length: 52. m; Column diameter: 0.26 mm; Tstart: 50. C; Tend: 220. C |

References

Weast and Grasselli, 1989
CRC Handbook of Data on Organic Compounds, 2nd Editon, Weast,R.C and Grasselli, J.G., ed(s)., CRC Press, Inc., Boca Raton, FL, 1989, 1. [all data]
Gorin and Vasil'eva, 1954
Gorin, Yu.A.; Vasil'eva, F.A.,
Zh. Obshch. Khim., 1954, 24, 1795. [all data]
Henne and Turk, 1942
Henne, A.L.; Turk, A.,
Conjugated diolefins by double bond displacement,
J. Am. Chem. Soc., 1942, 64, 826-8. [all data]
Karasev and Khabarova, 1940
Karasev, K.I.; Khabarova,
Zh. Obshch. Khim., 1940, 10, 1641. [all data]
Reif, 1908
Reif, J.,
The effect of magnesium organic compounds on orotonaldehyde (2-butene), and the optic behavior of the products,
Ber. Dtsch. Chem. Ges., 1908, 41, 2739-46. [all data]
Masclet, Mouvier, et al., 1981
Masclet, P.; Mouvier, G.; Bocquet, J.F.,
Effets electroniques et effets steriques dus a la substitution alcoyle dans les dienes conjugues,
J. Chim. Phys., 1981, 78, 99. [all data]
Kraevskii, 1963
Kraevskii, A.A.,
Zhur. Obshcei Khim. (in Rus.), 1963, 33, 1835. [all data]
Chupalov and Zenkevich, 1996
Chupalov, A.A.; Zenkevich, I.G.,
Chromatographic Characterization of Structural Transformations of Organic Compounds in Diels-Alder Reaction. Aliphatic Dienes and Dienophyls,
Zh. Org. Khim., 1996, 32, 6, 675-684. [all data]