Tungsten, tetracarbonylbis(η5-2,4-cyclopentadien-1-yl)di-, (w-w)

Gas phase ion energetics data

Data compiled by: Sharon G. Lias, John E. Bartmess, Joel F. Liebman, John L. Holmes, Rhoda D. Levin, and W. Gary Mallard

Ionization energy determinations

IE (eV) Method Reference Comment
6.9PEMorris-Sherwood, Powell, et al., 1984
7.36PEMorris-Sherwood, Powell, et al., 1984Vertical value

References

Morris-Sherwood, Powell, et al., 1984
Morris-Sherwood, B.J.; Powell, C.B.; Hall, M.B., Photoelectron spectra and molecular orbital calculations on bis(cyclopentadienyldicarbonylchromium, -molybdenum, and -tungsten): Nature of the bonding of linear semibridging carbonyls, J. Am. Chem. Soc., 1984, 106, 5079. [all data]