Pentane, 1-iodo-
- Formula: C5H11I
- Molecular weight: 198.0453
- IUPAC Standard InChIKey: BLXSFCHWMBESKV-UHFFFAOYSA-N
- CAS Registry Number: 628-17-1
- Chemical structure:
View 3d structure (requires JavaScript / HTML 5) - Other names: n-Amyl iodide; n-Pentyl iodide; Amyl iodide; Pentyl iodide; 1-Iodopentane; 1-Pentyl iodide; n-C5H11I; 1-Jodpentan; NSC 7901

Condensed phase thermochemistry data

Data compiled by: Eugene S. Domalski and Elizabeth D. Hearing
Constant pressure heat capacity of liquid
Cp,liquid (J/mol*K) | Temperature (K) | Reference |
---|---|---|
193.6 | 298.15 | Shehatta, 1993 |

Phase change data

Data compiled as indicated in comments:
BS - Robert L. Brown and Stephen E. Stein
TRC - Thermodynamics Research Center, NIST Boulder Laboratories, Chris Muzny director
AC - William E. Acree, Jr., James S. Chickos
ALS - Hussein Y. Afeefy, Joel F. Liebman, and Stephen E. Stein
Quantity | Value | Units | Method | Reference | Comment |
---|---|---|---|---|---|
Tboil | 427.7 | K | N/A | Aldrich Chemical Company Inc., 1990 | BS |
Tboil | 430.2 | K | N/A | Weast and Grasselli, 1989 | BS |
Tboil | 428. | K | N/A | American Tokyo Kasei, 1988 | BS |
Tboil | 419.7 | K | N/A | Holley, 1902 | Uncertainty assigned by TRC = 0.6 K; TRC |
Quantity | Value | Units | Method | Reference | Comment |
ΔvapH° | 45.27 | kJ/mol | N/A | Majer and Svoboda, 1985 | |
ΔvapH° | 44.4 | kJ/mol | CGC | Chickos, Hosseini, et al., 1995 | Based on data from 313. to 353. K.; AC |
ΔvapH° | 45.3 ± 0.1 | kJ/mol | C | Wadsö, Luoma, et al., 1968 | AC |
ΔvapH° | 45.27 ± 0.02 | kJ/mol | C | Wadso, 1968 | ALS |
Enthalpy of vaporization
ΔvapH (kJ/mol) | Temperature (K) | Method | Reference | Comment |
---|---|---|---|---|
43.1 | 327. | A,EST | Stephenson and Malanowski, 1987 | Based on data from 312. to 473. K. See also Li and Rossini, 1961 and Dykyj, 1972.; AC |

Gas phase ion energetics data

Data evaluated as indicated in comments:
L - Sharon G. Lias
Data compiled as indicated in comments:
LL - Sharon G. Lias and Joel F. Liebman
LLK - Sharon G. Lias, Rhoda D. Levin, and Sherif A. Kafafi
RDSH - Henry M. Rosenstock, Keith Draxl, Bruce W. Steiner, and John T. Herron
Quantity | Value | Units | Method | Reference | Comment |
---|---|---|---|---|---|
IE (evaluated) | 9.20 ± 0.01 | eV | N/A | N/A | L |
Ionization energy determinations
IE (eV) | Method | Reference | Comment |
---|---|---|---|
9.18 | EST | Luo and Pacey, 1992 | LL |
9.20 | PE | Boschi and Salahub, 1974 | LLK |
9.201 | S | Boschi and Salahub, 1972 | LLK |
9.18 ± 0.01 | PE | Cocksey, Eland, et al., 1971 | LLK |
9.22 | PE | Brogli and Heilbronner, 1971 | LLK |
9.21 | PE | Baker, Betteridge, et al., 1971 | LLK |
9.21 | PE | Baker, Betteridge, et al., 1971 | LLK |
9.19 ± 0.01 | PI | Watanabe, 1957 | RDSH |
9.4 | PE | Dromey and Peel, 1974 | Vertical value; LLK |

Normal alkane RI, non-polar column, custom temperature program

Data compiled by: NIST Mass Spectrometry Data Center, William E. Wallace, director

Column type Capillary
Active phase OV-1, SE-30, Methyl silicone, SP-2100, OV-101, DB-1, etc.
Column length (m) 50.
Carrier gas Hydrogen
Substrate
Column diameter (mm) 0.32
Phase thickness (μm)
Program not specified
I 912.
ReferenceWaggott and Davies, 1984
Comment MSDC-RI

Van Den Dool and Kratz RI, non-polar column, custom temperature program

Data compiled by: NIST Mass Spectrometry Data Center, William E. Wallace, director

Column type Capillary
Active phase DB-1
Column length (m) 15.
Carrier gas He
Substrate
Column diameter (mm) 0.53
Phase thickness (μm) 1.
Program 40C(3min) => 8C/min => 200(1min) => 5C/min => 300C(25min)
I 903.
ReferencePeng, 2000
Comment MSDC-RI

Kovats' RI, non-polar column, isothermal

Data compiled by: NIST Mass Spectrometry Data Center, William E. Wallace, director

Column type Packed
Active phase Apolane
Column length (m) 2.4
Carrier gas He
Substrate Chromosorb
Column diameter (mm)
Phase thickness (μm)
Temperature (C) 70.
I 917.8
ReferenceRiedo, Fritz, et al., 1976
Comment MSDC-RI

References

Shehatta, 1993
Shehatta, I.,
Heat capacity at constant pressure of some halogen compounds,
Thermochim. Acta, 1993, 213, 1-10. [all data]
Aldrich Chemical Company Inc., 1990
Aldrich Chemical Company Inc.,
Catalog Handbook of Fine Chemicals, Aldrich Chemical Company, Inc., Milwaukee WI, 1990, 1. [all data]
Weast and Grasselli, 1989
CRC Handbook of Data on Organic Compounds, 2nd Editon, Weast,R.C and Grasselli, J.G., ed(s)., CRC Press, Inc., Boca Raton, FL, 1989, 1. [all data]
American Tokyo Kasei, 1988
American Tokyo Kasei,
TCI American Organic Chemical 88/89 Catalog, American Tokyo Kasei, Portland, OR, 1988, 1610. [all data]
Holley, 1902
Holley, C.D.,
Liquid Mixtures of Minomum Boiling-Point,
J. Am. Chem. Soc., 1902, 24, 448. [all data]
Majer and Svoboda, 1985
Majer, V.; Svoboda, V.,
Enthalpies of Vaporization of Organic Compounds: A Critical Review and Data Compilation, Blackwell Scientific Publications, Oxford, 1985, 300. [all data]
Chickos, Hosseini, et al., 1995
Chickos, James S.; Hosseini, Sarah; Hesse, Donald G.,
Determination of vaporization enthalpies of simple organic molecules by correlations of changes in gas chromatographic net retention times,
Thermochimica Acta, 1995, 249, 41-62, https://doi.org/10.1016/0040-6031(95)90670-3
. [all data]
Wadsö, Luoma, et al., 1968
Wadsö, Ingemar; Luoma, Sinikka; Olson, Thomas; Norin, Torbjörn,
Heats of Vaporization of Organic Compounds. II. Chlorides, Bromides, and Iodides.,
Acta Chem. Scand., 1968, 22, 2438-2444, https://doi.org/10.3891/acta.chem.scand.22-2438
. [all data]
Wadso, 1968
Wadso, I.,
Heats of vaporization of organic compounds II. Chlorides, bromides, and iodides,
Acta Chem. Scand., 1968, 22, 2438. [all data]
Stephenson and Malanowski, 1987
Stephenson, Richard M.; Malanowski, Stanislaw,
Handbook of the Thermodynamics of Organic Compounds, 1987, https://doi.org/10.1007/978-94-009-3173-2
. [all data]
Li and Rossini, 1961
Li, J.C.M.; Rossini, F.D.,
Vapor Pressures and Boiling Points of the l-Fluoroalkanes, l-Chloroalkanes, l-Bromoalkanes, and l-Iodoalkanes, C 1 to C 20 .,
J. Chem. Eng. Data, 1961, 6, 2, 268-270, https://doi.org/10.1021/je60010a025
. [all data]
Dykyj, 1972
Dykyj, J.,
Petrochemia, 1972, 12, 1, 13. [all data]
Luo and Pacey, 1992
Luo, Y.-R.; Pacey, P.D.,
Effects of alkyl substitution on ionization energies of alkanes and haloalkanes and on heats of formation of their molecular cations. Part 2. Alkanes and chloro-, bromo- and iodoalkanes,
Int. J. Mass Spectrom. Ion Processes, 1992, 112, 63. [all data]
Boschi and Salahub, 1974
Boschi, R.A.A.; Salahub, D.R.,
The high resolution photoelectron spectra of some iodoalkanes, iodocycloalkanes, iodoalkenes, and fluoroiodohydrocarbons,
Can. J. Chem., 1974, 52, 1217. [all data]
Boschi and Salahub, 1972
Boschi, R.A.; Salahub, D.R.,
The far ultra-violet spectra of some 1-iodoalkanes,
Mol. Phys., 1972, 24, 289. [all data]
Cocksey, Eland, et al., 1971
Cocksey, B.J.; Eland, J.H.D.; Danby, C.J.,
The effect of alkyl substitution on ionisation potential,
J. Chem. Soc., 1971, (B), 790. [all data]
Brogli and Heilbronner, 1971
Brogli, F.; Heilbronner, E.,
The competition between spin orbit coupling and conjugation in alkyl halides and its repercussion on their photoelectron spectra,
Helv. Chim. Acta, 1971, 54, 1423. [all data]
Baker, Betteridge, et al., 1971
Baker, A.D.; Betteridge, D.; Kemp, N.R.; Kirby, R.E.,
Application of photoelectron spectrometry to pesticide analysis. II.Photoelectron spectra of hydroxy-, and halo-alkanes and halohydrins,
Anal. Chem., 1971, 43, 375. [all data]
Watanabe, 1957
Watanabe, K.,
Ionization potentials of some molecules,
J. Chem. Phys., 1957, 26, 542. [all data]
Dromey and Peel, 1974
Dromey, R.G.; Peel, J.B.,
Photoelectron spectroscopic correlation of the molecular orbitals of the alkanes and alkyl iodides,
J. Mol. Struct., 1974, 23, 53. [all data]