3-Cyclobutene-1,2-dione, 3,4-bis(methylseleno-
- Formula: C6H6O2Se2
- Molecular weight: 268.03
- IUPAC Standard InChIKey: ZKXALDYTEUYNED-UHFFFAOYSA-N
- CAS Registry Number: 62782-96-1
- Chemical structure:
View 3d structure (requires JavaScript / HTML 5) - Permanent link for this species. Use this link for bookmarking this species for future reference.

Gas phase ion energetics data

Data compiled by: Sharon G. Lias, Rhoda D. Levin, and Sherif A. Kafafi
Ionization energy determinations
IE (eV) | Method | Reference | Comment |
---|---|---|---|
8.1 | PE | Bock, Ried, et al., 1981 | |
8.34 | PE | Bock, Ried, et al., 1981 | Vertical value |

References

Bock, Ried, et al., 1981
Bock, H.; Ried, W.; Stein, U.,
Analyse und optimierung von gasphasen-reaktionen, 19. Pyrolyse von cyclobuten-1,2-dionen zu acetylenen,
Chem. Ber., 1981, 114, 673. [all data]