2-Propanone, (1-methylethylidene)hydrazone
- Formula: C6H12N2
- Molecular weight: 112.1729
- IUPAC Standard InChIKey: PFLUPZGCTVGDLV-UHFFFAOYSA-N
- CAS Registry Number: 627-70-3
- Chemical structure:
View 3d structure (requires JavaScript / HTML 5) - Other names: Acetone, azine; Acetone ketazine; Dimethyl ketazine

Phase change data

Data compiled by: Robert L. Brown and Stephen E. Stein
Quantity | Value | Units | Method | Reference | Comment |
---|---|---|---|---|---|
Tboil | 406.2 | K | N/A | Weast and Grasselli, 1989 |
Reduced pressure boiling point
Tboil (K) | Pressure (bar) | Reference |
---|---|---|
406.2 | 1.02 | Aldrich Chemical Company Inc., 1990 |
327.2 | 0.049 | Weast and Grasselli, 1989 |

Gas phase ion energetics data

Data compiled by: Sharon G. Lias, Rhoda D. Levin, and Sherif A. Kafafi
Ionization energy determinations
IE (eV) | Method | Reference |
---|---|---|
8.6 | PE | Vocelle, Dargelos, et al., 1977 |
7.97 | PE | Zverev, Vovna, et al., 1975 |
7.97 | PE | Zverev, Vovna, et al., 1973 |

Normal alkane RI, non-polar column, temperature ramp

Column type | Active phase | I | Reference | Comment |
---|---|---|---|---|
Capillary | OV-101 | 828. | Zenkevich, 2005 | 25. m/0.20 mm/0.10 μm, N2/He, 6. K/min; Tstart: 50. C; Tend: 250. C |

References

Weast and Grasselli, 1989
CRC Handbook of Data on Organic Compounds, 2nd Editon, Weast,R.C and Grasselli, J.G., ed(s)., CRC Press, Inc., Boca Raton, FL, 1989, 1. [all data]
Aldrich Chemical Company Inc., 1990
Aldrich Chemical Company Inc.,
Catalog Handbook of Fine Chemicals, Aldrich Chemical Company, Inc., Milwaukee WI, 1990, 1. [all data]
Vocelle, Dargelos, et al., 1977
Vocelle, D.; Dargelos, A.; Pottier, R.; Sandorfy, C.,
Photoelectron and far-ultraviolet absorption spectra of nonaromatic azomethine compounds,
J. Chem. Phys., 1977, 66, 2860. [all data]
Zverev, Vovna, et al., 1975
Zverev, V.V.; Vovna, V.I.; Kitaev, Yu.P.; Vilesov, F.I.,
Photoelectron spectrum and structure of formaldehyde azine,
J. Struct. Chem., 1975, 16, 947. [all data]
Zverev, Vovna, et al., 1973
Zverev, V.V.; Vovna, V.I.; El'man, M.S.; Kitaev, Yu.P.; Vilesov, F.I.,
Photoelectronic spectra and electronic and three-dimensional structures of acyclic azines,
Dokl. Phys. Chem., 1973, 213, 1100, In original 1117. [all data]
Zenkevich, 2005
Zenkevich, I.G.,
Experimentally measured retention indices., 2005. [all data]